Methane, bromodifluoro-
- Formula: CHBrF2
- Molecular weight: 130.919
- IUPAC Standard InChIKey: GRCDJFHYVYUNHM-UHFFFAOYSA-N
- CAS Registry Number: 1511-62-2
- Chemical structure:
View 3d structure (requires JavaScript / HTML 5) - Other names: Bromodifluoromethane; CHBrF2; Difluorobromomethane

Gas phase thermochemistry data

Data compiled by: Hussein Y. Afeefy, Joel F. Liebman, and Stephen E. Stein
Quantity | Value | Units | Method | Reference | Comment |
---|---|---|---|---|---|
ΔfH°gas | -425.3 ± 0.9 | kJ/mol | Eqk | Okafo and Whittle, 1974 |

Phase change data

Data compiled as indicated in comments:
BS - Robert L. Brown and Stephen E. Stein
TRC - Thermodynamics Research Center, NIST Boulder Laboratories, Chris Muzny director
AC - William E. Acree, Jr., James S. Chickos
Quantity | Value | Units | Method | Reference | Comment |
---|---|---|---|---|---|
Tboil | 258.6 | K | N/A | Buckingham and Donaghy, 1982 | BS |
Quantity | Value | Units | Method | Reference | Comment |
Tfus | 128. | K | N/A | Salvi-Narkhede, Wang, et al., 1992 | Uncertainty assigned by TRC = 2. K; TRC |
Quantity | Value | Units | Method | Reference | Comment |
Tc | 411.98 | K | N/A | Salvi-Narkhede, Wang, et al., 1992 | Uncertainty assigned by TRC = 0.2 K; method of measurement not clearly described; TRC |
Quantity | Value | Units | Method | Reference | Comment |
Pc | 51.32 | bar | N/A | Salvi-Narkhede, Wang, et al., 1992 | Uncertainty assigned by TRC = 0.10 bar; TRC |
Quantity | Value | Units | Method | Reference | Comment |
Vc | 0.275 | l/mol | N/A | Salvi-Narkhede, Wang, et al., 1992 | Uncertainty assigned by TRC = 0.005 l/mol; TRC |
Enthalpy of vaporization
ΔvapH (kJ/mol) | Temperature (K) | Method | Reference | Comment |
---|---|---|---|---|
24.0 | 244. | A | Stephenson and Malanowski, 1987 | Based on data from 194. to 259. K.; AC |
24.7 | 209. | N/A | Kudchadker, Kudchadker, et al., 1979 | Based on data from 194. to 288. K.; AC |

Reaction thermochemistry data

Data compiled by: Hussein Y. Afeefy, Joel F. Liebman, and Stephen E. Stein
Individual Reactions
By formula: CH2F2 + Br2 = HBr + CHBrF2
Quantity | Value | Units | Method | Reference | Comment |
---|---|---|---|---|---|
ΔrH° | -39.9 ± 0.3 | kJ/mol | Eqk | Okafo and Whittle, 1974 | gas phase |

References

Okafo and Whittle, 1974
Okafo, E.N.; Whittle, E.,
Bond dissociation energies from equilibrium studies. Part 5.-The equilibria Br2 + CH2F2 = HBr + CHF2Br and Br2 + CH3F = HBr + CH2FBr. Determination of D(CHF2-Br) and ΔH°f (CHF2Br,g),
Trans. Faraday Soc., 1974, 17, 1366-1375. [all data]
Buckingham and Donaghy, 1982
Buckingham, J.; Donaghy, S.M.,
Dictionary of Organic Compounds: Fifth Edition, Chapman and Hall, New York, 1982, 1. [all data]
Salvi-Narkhede, Wang, et al., 1992
Salvi-Narkhede, M.; Wang, B.H.; Adcock, J.I.; Van Hook, W.A.,
Vapor pressures, liquid molar volumes, vapor non-ideality, and critical properties of some partially fluorinated ethers (CF3OCF2CF2H, CF3OCF2H, and CF3OCH3), some perfluoroethers (CF3OCF2OCF3, c-CF2O,
J. Chem. Thermodyn., 1992, 24, 1065-75. [all data]
Stephenson and Malanowski, 1987
Stephenson, Richard M.; Malanowski, Stanislaw,
Handbook of the Thermodynamics of Organic Compounds, 1987, https://doi.org/10.1007/978-94-009-3173-2
. [all data]
Kudchadker, Kudchadker, et al., 1979
Kudchadker, A.P.; Kudchadker, S.A.; Shukla, R.P.; Patnaik, P.R.,
Vapor pressures and boiling points of selected halomethanes,
J. Phys. Chem. Ref. Data, 1979, 8, 2, 499, https://doi.org/10.1063/1.555600
. [all data]
Davidson, 1951
Davidson, N.,
J. Am. Chem. Soc, 1951, 73, 467. [all data]