Arsine, trisilyl-
- Formula: AsH9Si3
- Molecular weight: 168.2496
- IUPAC Standard InChIKey: ISYBXVAUXYUVPO-UHFFFAOYSA-N
- CAS Registry Number: 15110-34-6
- Chemical structure:
View 3d structure (requires JavaScript / HTML 5) - Permanent link for this species. Use this link for bookmarking this species for future reference.

Phase change data

Data compiled by: William E. Acree, Jr., James S. Chickos
Enthalpy of vaporization
ΔvapH (kJ/mol) | Temperature (K) | Reference | Comment |
---|---|---|---|
41. | 272. | Amberger and Boeters, 1962 | Based on data from 258. to 287. K. |

Gas phase ion energetics data

Data compiled by: Sharon G. Lias, Rhoda D. Levin, and Sherif A. Kafafi
Ionization energy determinations
IE (eV) | Method | Reference | Comment |
---|---|---|---|
9.3 ± 0.1 | PE | Cradock, Ebsworth, et al., 1972 | Vertical value |

References

Amberger and Boeters, 1962
Amberger, E.; Boeters, H.,
Darstellung und Eigenschaften von Trisilylarsin,
Angew. Chem., 1962, 74, 8, 293-293, https://doi.org/10.1002/ange.19620740811
. [all data]
Cradock, Ebsworth, et al., 1972
Cradock, S.; Ebsworth, E.A.V.; Savage, W.J.; Whiteford, R.A.,
Photoelectron spectra of some methyl, silyl and germyl amines, phosphines and arsines,
J. Chem. Soc. Faraday Trans. 2, 1972, 68, 934. [all data]