Phosphine, trisilyl-
- Formula: H9PSi3
- Molecular weight: 124.3017
- IUPAC Standard InChIKey: UANZKUUHUWJRJL-UHFFFAOYSA-N
- CAS Registry Number: 15110-33-5
- Chemical structure:
View 3d structure (requires JavaScript / HTML 5) - Permanent link for this species. Use this link for bookmarking this species for future reference.

Phase change data

Data compiled by: William E. Acree, Jr., James S. Chickos
Enthalpy of vaporization
ΔvapH (kJ/mol) | Temperature (K) | Reference | Comment |
---|---|---|---|
36.4 | 263. | Amberger and Boeters, 1962 | Based on data from 243. to 284. K. |

Gas phase ion energetics data

Data compiled by: Sharon G. Lias, Rhoda D. Levin, and Sherif A. Kafafi
Ionization energy determinations
IE (eV) | Method | Reference | Comment |
---|---|---|---|
9.3 ± 0.1 | PE | Cradock, Ebsworth, et al., 1972 | Vertical value |

References

Amberger and Boeters, 1962
Amberger, E.; Boeters, H.,
Darstellung von Trisilylphosphin,
Angew. Chem., 1962, 74, 1, 32-33, https://doi.org/10.1002/ange.19620740115
. [all data]
Cradock, Ebsworth, et al., 1972
Cradock, S.; Ebsworth, E.A.V.; Savage, W.J.; Whiteford, R.A.,
Photoelectron spectra of some methyl, silyl and germyl amines, phosphines and arsines,
J. Chem. Soc. Faraday Trans. 2, 1972, 68, 934. [all data]