Benzene, 1,3-dimethoxy-
- Formula: C8H10O2
- Molecular weight: 138.1638
- IUPAC Standard InChIKey: DPZNOMCNRMUKPS-UHFFFAOYSA-N
- CAS Registry Number: 151-10-0
- Chemical structure:
View 3d structure (requires JavaScript / HTML 5) - Other names: Benzene, m-dimethoxy-; m-Dimethoxybenzene; Resorcinol dimethyl ether; 1,3-Dimethoxybenzene; Dimethylether resorcinolu; 3-Methoxyanisole; m-Methoxyanisole

Gas phase ion energetics data

Data compiled as indicated in comments:
LLK - Sharon G. Lias, Rhoda D. Levin, and Sherif A. Kafafi
RDSH - Henry M. Rosenstock, Keith Draxl, Bruce W. Steiner, and John T. Herron
LL - Sharon G. Lias and Joel F. Liebman
Ionization energy determinations
IE (eV) | Method | Reference | Comment |
---|---|---|---|
8.2 ± 0.1 | EI | Brown, 1970 | RDSH |
8.0 ± 0.15 | CTS | Voigt and Reid, 1964 | RDSH |
8.14 | PE | Anderson, Kollman, et al., 1979 | Vertical value; LLK |
8.18 | PE | Domelsmith and Houk, 1978 | Vertical value; LLK |
Appearance energy determinations
Ion | AE (eV) | Other Products | Method | Reference | Comment |
---|---|---|---|---|---|
C6H5+ | 14.4 | CH3+CO+H2O | EI | Mori, Ogawa, et al., 1992 | LL |
C6H7O+ | 12.5 | CH3+CO | EI | Mori, Ogawa, et al., 1992 | LL |
C7H7O2+ | 11.2 ± 0.1 | CH3 | EI | Brown, 1970 | RDSH |
C7H7O2+ | 11.6 ± 0.1 | CH3 | EI | Tait, Shannon, et al., 1962 | RDSH |
C7H8O+ | 11.0 ± 0.1 | CH2O | EI | Brown, 1970 | RDSH |

Phase change data

Data compiled as indicated in comments:
BS - Robert L. Brown and Stephen E. Stein
TRC - Thermodynamics Research Center, NIST Boulder Laboratories, Chris Muzny director
AC - William E. Acree, Jr., James S. Chickos
Quantity | Value | Units | Method | Reference | Comment |
---|---|---|---|---|---|
Tboil | 490.7 | K | N/A | Weast and Grasselli, 1989 | BS |
Tboil | 490.25 | K | N/A | Perkin, 1896 | Uncertainty assigned by TRC = 1. K; TRC |
Quantity | Value | Units | Method | Reference | Comment |
Tfus | 237.85 | K | N/A | Timmermans, 1921 | Uncertainty assigned by TRC = 0.3 K; TRC |
Quantity | Value | Units | Method | Reference | Comment |
ΔvapH° | 14.7 ± 0.33 | kcal/mol | C | Matos, Miranda, et al., 2000 | AC |
Reduced pressure boiling point
Tboil (K) | Pressure (atm) | Reference | Comment |
---|---|---|---|
359.2 | 0.009 | Aldrich Chemical Company Inc., 1990 | BS |
Enthalpy of vaporization
ΔvapH (kcal/mol) | Temperature (K) | Method | Reference | Comment |
---|---|---|---|---|
14.5 | 373. | A,GC | Stephenson and Malanowski, 1987 | Based on data from 358. to 423. K. See also Kundel, Lille, et al., 1975.; AC |

Kovats' RI, non-polar column, isothermal

View large format table.

Column type Active phase Temperature (C) I Reference Comment
PackedApiezon L100.1147.Bogoslovsky, Anvaer, et al., 1978Chromatone N AW DNCS
PackedApiezon L150.1164.Bogoslovsky, Anvaer, et al., 1978Chromatone N AW DNCS

Van Den Dool and Kratz RI, non-polar column, temperature ramp

View large format table.

Column type Active phase I Reference Comment
CapillaryOV-11138.8Gautzsch and Zinn, 19968. K/min; Tstart: 35. C; Tend: 300. C

Van Den Dool and Kratz RI, non-polar column, custom temperature program

View large format table.

Column type Active phase I Reference Comment
CapillaryVF-5MS1181.9Tret'yakov, 200830. m/0.25 mm/0.25 μm, He; Program: Multi-step temperature program; T(initial)=60C; T(final)=270C

Van Den Dool and Kratz RI, polar column, custom temperature program

View large format table.

Column type Active phase I Reference Comment
CapillaryDB-Wax1730.Ferrari, Lablanquie, et al., 200460. m/0.25 mm/0.25 μm, He; Program: 35C(0.7min) => 20C/min => 70C => 4C/min => 240C

Normal alkane RI, non-polar column, custom temperature program

View large format table.

Column type Active phase I Reference Comment
CapillaryPolydimethyl siloxane with 5 % Ph groups1175.Robinson, Adams, et al., 2012Program: not specified
CapillaryPolydimethyl siloxane with 5 % Ph groups1182.Robinson, Adams, et al., 2012Program: not specified
CapillarySE-301143.Vinogradov, 2004Program: not specified
CapillaryRTX-5 MS1158.Rogerson, Azevedo, et al., 200230. m/0.32 mm/1. μm, He; Program: 40C(20min) => 1.5C/min => 200C (4min) => 10C/min => 250C (120min)

Normal alkane RI, polar column, temperature ramp

View large format table.

Column type Active phase I Reference Comment
CapillaryAT-Wax1761.Kiss, Csoka, et al., 201160. m/0.25 mm/0.25 μm, Helium, 4. K/min; Tstart: 60. C; Tend: 280. C

Normal alkane RI, polar column, custom temperature program

View large format table.

Column type Active phase I Reference Comment
CapillaryCarbowax 20M1740.Vinogradov, 2004Program: not specified
CapillarySupelcowax-101709.Rogerson, Azevedo, et al., 200260. m/0.25 mm/0.25 μm, He; Program: 40C(20min) => 1.5C/min => 200C (4min) => 10C/min => 250C (120min)
CapillaryDB-Wax1762.Caldentey, Daria Fumi, et al., 199830. m/0.25 mm/0.25 μm, He; Program: 25C(8min) => 4C/min => 60C => 6C/min => 160C => 20C/min => 200C
CapillaryDB-Wax1737.Peng, Yang, et al., 1991Program: not specified

References

Brown, 1970
Brown, P.,
Kinetic studies in mass spectrometry. VIII. Competing [M-CH3] and [M-CH2O] reactions in substituted anisoles. Approximate activation energies from ionization appearance potentials,
Org. Mass Spectrom., 1970, 4, 519. [all data]
Voigt and Reid, 1964
Voigt, E.M.; Reid, C.,
Ionization potentials of substituted benzenes and their charge-transfer spectra with tetracyanoethylene,
J. Am. Chem. Soc., 1964, 86, 3930. [all data]
Anderson, Kollman, et al., 1979
Anderson, G.M., III; Kollman, P.A.; Domelsmith, L.N.; Houk, K.N.,
Methoxy group nonplanarity in o-dimethoxybenzenes. Simple predictive models for conformations and rotational barriers in alkoxyaromatics,
J. Am. Chem. Soc., 1979, 101, 2344. [all data]
Domelsmith and Houk, 1978
Domelsmith, L.N.; Houk, K.N.,
Photoelectron spectroscopic studies of hallucinogens: The use of ionization potentials in QSAR,
NIDA Res. Monogr., 1978, 22, 423. [all data]
Mori, Ogawa, et al., 1992
Mori, Y.; Ogawa, Y.; Shinoda, H.; Kitagawa, T.,
Two competing fragmentation processes in dimethoxybenzenes depending on their positional isomers: Elimination of CH3 and CHnO (n = 1-3) and formation of methoxycyclopentadienyl and protonated phenol ions,
Org. Mass Spectrom., 1992, 27, 578. [all data]
Tait, Shannon, et al., 1962
Tait, J.M.S.; Shannon, T.W.; Harrison, A.G.,
The structure of substituted C7 ions from benzyl derivatives at the appearance potential threshold,
J. Am. Chem. Soc., 1962, 84, 4. [all data]