1,2,5-Thiadiazolidine,2,5-dimethyl-,1-oxide
- Formula: C4H10N2OS
- Molecular weight: 134.200
- IUPAC Standard InChIKey: QJWITPSBBNKLNZ-UHFFFAOYSA-N
- CAS Registry Number: 15108-72-2
- Chemical structure:
View 3d structure (requires JavaScript / HTML 5) - Permanent link for this species. Use this link for bookmarking this species for future reference.

Gas phase ion energetics data

Data compiled by: Sharon G. Lias, Rhoda D. Levin, and Sherif A. Kafafi
Ionization energy determinations
IE (eV) | Method | Reference | Comment |
---|---|---|---|
8.2 | PE | Bock and Solouki, 1974 | Vertical value |

References

Bock and Solouki, 1974
Bock, H.; Solouki, B.,
Photoelektronenspektren und molekuleigenschaften, XXXV. Sulfoxide X2SO - beispiele fur den nutzen von korrelations - diagrammen bei der diskussion von substituenteneffekten und von geometrischen storungen,
Chem. Ber., 1974, 107, 2299. [all data]