Tin, sec-butyl-trimethyl-
- Formula: C7H18Sn
- Molecular weight: 220.928
- IUPAC Standard InChIKey: SHZDNLWYJHWWKI-UHFFFAOYSA-N
- CAS Registry Number: 15095-79-1
- Chemical structure:
View 3d structure (requires JavaScript / HTML 5) - Permanent link for this species. Use this link for bookmarking this species for future reference.

Gas phase ion energetics data

Data compiled by: Henry M. Rosenstock, Keith Draxl, Bruce W. Steiner, and John T. Herron
Ionization energy determinations
IE (eV) | Method | Reference |
---|---|---|
8.27 ± 0.01 | EI | Yergey and Lampe, 1968 |
Appearance energy determinations
Ion | AE (eV) | Other Products | Method | Reference | Comment |
---|---|---|---|---|---|
C3H9Sn+ | 9.20 ± 0.05 | C4H9 | EI | Yergey and Lampe, 1968 | |
C6H15Sn+ | 9.76 ± 0.19 | CH3 | EI | Yergey and Lampe, 1968 |

References

Yergey and Lampe, 1968
Yergey, A.L.; Lampe, F.W.,
An electron impact study of ionization and dissociation of trimethylstannanes,
J. Organometal. Chem., 1968, 15, 339. [all data]