Thiourea, N-(1-methylethyl)-N'-phenyl-
- Formula: C10H14N2S
- Molecular weight: 194.297
- IUPAC Standard InChIKey: LFBMRUOVWMEFFZ-UHFFFAOYSA-N
- CAS Registry Number: 15093-36-4
- Chemical structure:
View 3d structure (requires JavaScript / HTML 5) - Other names: Urea, 1-isopropyl-3-phenyl-2-thio-; N-Phenyl-N'-isopropylthiourea

Gas phase ion energetics data

Data compiled by: Sharon G. Lias, Rhoda D. Levin, and Sherif A. Kafafi
Ionization energy determinations
IE (eV) | Method | Reference |
---|---|---|
7.90 ± 0.05 | EI | Baldwin, Loudon, et al., 1976 |

References

Baldwin, Loudon, et al., 1976
Baldwin, M.A.; Loudon, A.G.; Maccoll, A.; Webb, K.S.,
The nature and fragmentation pathways of the molecular ions of some arylureas, arylthioureas, acetanilides, thioacetanilides and related compounds,
Org. Mass Spectrom., 1976, 11, 1181. [all data]