Benzene, 1,4-dimethoxy-
- Formula: C8H10O2
- Molecular weight: 138.1638
- IUPAC Standard InChIKey: OHBQPCCCRFSCAX-UHFFFAOYSA-N
- CAS Registry Number: 150-78-7
- Chemical structure:
View 3d structure (requires JavaScript / HTML 5) - Other names: Benzene, p-dimethoxy-; p-Dimethoxybenzene; Dimethylhydroquinone ether; DMB; Hydroquinone dimethyl ether; Quinol dimethyl ether; 1,4-Dimethoxybenzene; p-Methoxyanisole; Dimethyl ether hydroquinone; USAF AN-9; Anisole, p-methoxy-; Dimethylether hydrochinonu; Usaf uctl-1791; 4-Methoxyanisole; Methyl p-methoxyphenyl ether; 4-Methoxyphenol, methyl ether; 1,4-Dimethoxybenzol; Methyl 4-methoxyphenyl ether; NSC 7483; Dimethylhydroquinone; Dimethylolbenzimidazolon; 1,3-Bis(hydroxymethyl)-2-benzimidazolinone; 2-Benzimidazolinone, 1,3-bis(hydroxymethyl)-

Phase change data

Data compiled as indicated in comments:
BS - Robert L. Brown and Stephen E. Stein
TRC - Thermodynamics Research Center, NIST Boulder Laboratories, Chris Muzny director
AC - William E. Acree, Jr., James S. Chickos
Quantity | Value | Units | Method | Reference | Comment |
---|---|---|---|---|---|
Tboil | 485.8 | K | N/A | Weast and Grasselli, 1989 | BS |
Tboil | 485.8 | K | N/A | Perkin, 1896 | Uncertainty assigned by TRC = 1.5 K; TRC |
Quantity | Value | Units | Method | Reference | Comment |
Tfus | 329. | K | N/A | Vowinkel, 1966 | Uncertainty assigned by TRC = 3. K; TRC |
Tfus | 329.45 | K | N/A | Nagakura and Baba, 1952 | Uncertainty assigned by TRC = 0.6 K; TRC |
Quantity | Value | Units | Method | Reference | Comment |
ΔsubH° | 84.1 ± 2.3 | kJ/mol | C | Matos, Miranda, et al., 2000 | AC |
Reduced pressure boiling point
Tboil (K) | Pressure (bar) | Reference | Comment |
---|---|---|---|
382.2 | 0.027 | Weast and Grasselli, 1989 | BS |
Enthalpy of vaporization
ΔvapH (kJ/mol) | Temperature (K) | Method | Reference | Comment |
---|---|---|---|---|
62.1 | 313. | A | Stephenson and Malanowski, 1987 | Based on data from 298. to 357. K.; AC |

Gas phase ion energetics data

Data evaluated as indicated in comments:
L - Sharon G. Lias
Data compiled as indicated in comments:
LBLHLM - Sharon G. Lias, John E. Bartmess, Joel F. Liebman, John L. Holmes, Rhoda D. Levin, and W. Gary Mallard
LLK - Sharon G. Lias, Rhoda D. Levin, and Sherif A. Kafafi
RDSH - Henry M. Rosenstock, Keith Draxl, Bruce W. Steiner, and John T. Herron
LL - Sharon G. Lias and Joel F. Liebman
Quantity | Value | Units | Method | Reference | Comment |
---|---|---|---|---|---|
IE (evaluated) | 7.56 ± 0.11 | eV | N/A | N/A | L |
Ionization energy determinations
IE (eV) | Method | Reference | Comment |
---|---|---|---|
7.78 ± 0.03 | PI | Ponomarev, Arapov, et al., 1986 | LBLHLM |
7.53 ± 0.03 | S | Oikawa, Abe, et al., 1985 | LBLHLM |
7.54 | PE | Behan, Johnstone, et al., 1976 | LLK |
7.45 | EI | Cooks, Bertrand, et al., 1973 | LLK |
7.9 ± 0.1 | EI | Brown, 1970 | RDSH |
7.7 ± 0.15 | CTS | Voigt and Reid, 1964 | RDSH |
7.90 | PE | Chmutova, Vtyurina, et al., 1979 | Vertical value; LLK |
7.96 | PE | Anderson, Kollman, et al., 1979 | Vertical value; LLK |
7.90 | PE | Domelsmith and Houk, 1978 | Vertical value; LLK |
7.83 ± 0.015 | PE | Klessinger, Asmus, et al., 1975 | Vertical value; LLK |
7.90 | PE | Bock and Wagner, 1972 | Vertical value; LLK |
7.90 | PE | Baker, May, et al., 1968 | Vertical value; RDSH |
Appearance energy determinations
Ion | AE (eV) | Other Products | Method | Reference | Comment |
---|---|---|---|---|---|
C6H5+ | 15.8 | CH3+CO+H2O | EI | Mori, Ogawa, et al., 1992 | LL |
C6H7O+ | 12.9 | CH3+CO | EI | Mori, Ogawa, et al., 1992 | LL |
C7H7O2+ | 11.27 ± 0.05 | CH3 | PI | Ponomarev, Arapov, et al., 1986 | LBLHLM |
C7H7O2+ | 11.0 ± 0.1 | CH3 | EI | Brown, 1970 | RDSH |
C7H7O2+ | 10.4 ± 0.1 | CH3 | EI | Tait, Shannon, et al., 1962 | RDSH |
C7H8O+ | 11.00 | HCHO | EI | Cooks, Bertrand, et al., 1973 | LLK |

Normal alkane RI, non-polar column, temperature ramp

Data compiled by: NIST Mass Spectrometry Data Center, William E. Wallace, director

Column type CapillaryCapillaryCapillaryCapillaryCapillary
Active phase VF-5 MSZP-5HP-5MSCP Sil 8 CBHP-101
Column length (m) 30.60.30.30.25.
Carrier gas HeliumHeHe He
Substrate
Column diameter (mm) 0.250.250.250.250.2
Phase thickness (μm) 0.250.250.250.250.2
Tstart (C) 60.40.60.40.70.
Tend (C) 280.260.280.250.200.
Heat rate (K/min) 6.6.3.3.3.
Initial hold (min) 1.7. 5.2.
Final hold (min) 3.1. 20.15.
I 1185.1175.1165.1168.1158.
ReferenceSouza, Re-Poppi, et al., 2012Füssel, Dötterl, et al., 2007Bozin, Mimicá-Dukic, et al., 2006Li, Lee, et al., 2006Mastelic, Jerkovic, et al., 2006
Comment MSDC-RI MSDC-RI MSDC-RI MSDC-RI MSDC-RI
Column type CapillaryCapillaryCapillaryCapillaryCapillary
Active phase DB-1DB-1DB-1DB-1CBP-1
Column length (m) 60.60.60.60.30.
Carrier gas HeHeHeHeHe
Substrate
Column diameter (mm) 0.320.320.320.320.25
Phase thickness (μm) 0.250.250.250.25
Tstart (C) 35.35.35.35.60.
Tend (C) 230.230.230.230.240.
Heat rate (K/min) 2.2.2.2.4.
Initial hold (min) 4.4.4.4.
Final hold (min) 25.25.25.25.
I 1128.1130.1130.1132.1122.
ReferencePark, Lee, et al., 2004Park, Lee, et al., 2004Park, Lee, et al., 2004Park, Lee, et al., 2004Lamarque, Maestri, et al., 1998
Comment MSDC-RI MSDC-RI MSDC-RI MSDC-RI MSDC-RI
Column type CapillaryCapillaryCapillary
Active phase CP Sil 5 CBDB-1Ultra-1
Column length (m) 25.30.25.
Carrier gas N2HeHe
Substrate
Column diameter (mm) 0.320.250.32
Phase thickness (μm) 0.25 0.25
Tstart (C) 50.70.80.
Tend (C) 290.300.260.
Heat rate (K/min) 4.3.3.
Initial hold (min)  5.
Final hold (min)
I 1171.1122.1131.
ReferenceBos, Woerdenbag, et al., 1997Guy and Vernin, 1996Okumura, 1991
Comment MSDC-RI MSDC-RI MSDC-RI

Normal alkane RI, polar column, temperature ramp

Data compiled by: NIST Mass Spectrometry Data Center, William E. Wallace, director

Column type CapillaryCapillaryCapillaryCapillaryCapillary
Active phase AT-WaxDB-WaxSupelcowax-10PEG-20MTC-Wax
Column length (m) 60.60.30.60.60.
Carrier gas HeliumH2HeHe
Substrate
Column diameter (mm) 0.250.320.250.250.25
Phase thickness (μm) 0.250.25
Tstart (C) 60.40.60.70.80.
Tend (C) 280.230.240.210.240.
Heat rate (K/min) 4.4.4.3.3.
Initial hold (min)  5.  5.
Final hold (min)  25.
I 1752.1728.1747.1759.1747.
ReferenceKiss, Csoka, et al., 2011Dregus and Engel, 2003Lamarque, Maestri, et al., 1998Awano, Honda, et al., 1997Shuichi, Masazumi, et al., 1996
Comment MSDC-RI MSDC-RI MSDC-RI MSDC-RI MSDC-RI
Column type Capillary
Active phase DB-Wax
Column length (m) 30.
Carrier gas Helium
Substrate
Column diameter (mm) 0.32
Phase thickness (μm)
Tstart (C) 40.
Tend (C) 200.
Heat rate (K/min) 6.
Initial hold (min) 1.
Final hold (min)
I 1750.
ReferenceAndersen J.F., Mikolajczak K.L., et al., 1987
Comment MSDC-RI

Normal alkane RI, polar column, custom temperature program

Data compiled by: NIST Mass Spectrometry Data Center, William E. Wallace, director

Column type Capillary
Active phase DB-Wax
Column length (m) 30.
Carrier gas He
Substrate
Column diameter (mm) 0.25
Phase thickness (μm) 0.25
Program 25C(8min) => 4C/min => 60C => 6C/min => 160C => 20C/min => 200C
I 1757.
ReferenceCaldentey, Daria Fumi, et al., 1998
Comment MSDC-RI

References

Weast and Grasselli, 1989
CRC Handbook of Data on Organic Compounds, 2nd Editon, Weast,R.C and Grasselli, J.G., ed(s)., CRC Press, Inc., Boca Raton, FL, 1989, 1. [all data]
Perkin, 1896
Perkin, W.H.,
LXIX. On Magnetic Rotatory Power, especially of Aromatic Compounds,
J. Chem. Soc., 1896, 69, 1025-1257. [all data]
Vowinkel, 1966
Vowinkel, E.,
Preparation of Aryl Alky8 Ethers by Means of O-Alkyl-N,N'-dicyclohexyl- isoureas,
Chem. Ber., 1966, 99, 1479-84. [all data]
Nagakura and Baba, 1952
Nagakura, S.; Baba, H.,
Dipole moments and near-ultraviolet absorption of some monosubsti- tuted benzenes--the effect of solvents and hydrogen bonding.,
J. Am. Chem. Soc., 1952, 74, 5693. [all data]
Matos, Miranda, et al., 2000
Matos, M.A.R.; Miranda, M.S.; Morais, V.M.F.,
Calorimetric and Theoretical Determination of Standard Enthalpies of Formation of Dimethoxy- and Trimethoxybenzene Isomers,
J. Phys. Chem. A, 2000, 104, 40, 9260-9265, https://doi.org/10.1021/jp001928g
. [all data]
Stephenson and Malanowski, 1987
Stephenson, Richard M.; Malanowski, Stanislaw,
Handbook of the Thermodynamics of Organic Compounds, 1987, https://doi.org/10.1007/978-94-009-3173-2
. [all data]
Ponomarev, Arapov, et al., 1986
Ponomarev, D.A.; Arapov, O.V.; Sergeev, Y.L.; Chistyakov, A.B.,
[Title unavailable],
Izv. Vyssh. Uchebn. Zaved., Khim. Khim. Tekhnol., 1986, 29, 107. [all data]
Oikawa, Abe, et al., 1985
Oikawa, A.; Abe, H.; Mikami, N.; Ito, M.,
Electronic spectra and ionization potentials of rotational isomers of severaldDisubstituted benzenes,
Chem. Phys. Lett., 1985, 116, 50. [all data]
Behan, Johnstone, et al., 1976
Behan, J.M.; Johnstone, R.A.W.; Bentley, T.W.,
An evaluation of empirical methods for calculating the ionization potentials of substituted benzenes,
Org. Mass Spectrom., 1976, 11, 207. [all data]
Cooks, Bertrand, et al., 1973
Cooks, R.G.; Bertrand, M.; Beynon, J.H.; Rennekamp, M.E.; Setser, D.W.,
Energy partitioning data as an ion structure probe. Substituted anisoles,
J. Am. Chem. Soc., 1973, 95, 1732. [all data]
Brown, 1970
Brown, P.,
Kinetic studies in mass spectrometry. VIII. Competing [M-CH3] and [M-CH2O] reactions in substituted anisoles. Approximate activation energies from ionization appearance potentials,
Org. Mass Spectrom., 1970, 4, 519. [all data]
Voigt and Reid, 1964
Voigt, E.M.; Reid, C.,
Ionization potentials of substituted benzenes and their charge-transfer spectra with tetracyanoethylene,
J. Am. Chem. Soc., 1964, 86, 3930. [all data]
Chmutova, Vtyurina, et al., 1979
Chmutova, G.A.; Vtyurina, N.N.; Komina, T.V.; Gazizov, I.G.; Bock, H.,
Molecular-orbital characteristics of anisole isologs X-C6H4-ECH3 (E = O, S, Se) containing donor substituents X,
Zh. Obshch. Khim., 1979, 49, 192. [all data]
Anderson, Kollman, et al., 1979
Anderson, G.M., III; Kollman, P.A.; Domelsmith, L.N.; Houk, K.N.,
Methoxy group nonplanarity in o-dimethoxybenzenes. Simple predictive models for conformations and rotational barriers in alkoxyaromatics,
J. Am. Chem. Soc., 1979, 101, 2344. [all data]
Domelsmith and Houk, 1978
Domelsmith, L.N.; Houk, K.N.,
Photoelectron spectroscopic studies of hallucinogens: The use of ionization potentials in QSAR,
NIDA Res. Monogr., 1978, 22, 423. [all data]
Klessinger, Asmus, et al., 1975
Klessinger, M.; Asmus, P.; Kraatz, U.,
Photoelektronenspektren organischer verbindungen-VII,
Tetrahedron, 1975, 31, 517. [all data]
Bock and Wagner, 1972
Bock, H.; Wagner, G.,
Electron lone pairs in organic sulfides and disulfides,
Angew. Chem. Int. Ed. Engl., 1972, 11, 119. [all data]
Baker, May, et al., 1968
Baker, A.D.; May, D.P.; Turner, D.W.,
Molecular photoelectron spectroscopy. Part VII. The vertical ionisation potentials of benzene and some of its monosubstituted and 1,4-disubstituted derivatives,
J. Chem. Soc. B, 1968, 22. [all data]
Mori, Ogawa, et al., 1992
Mori, Y.; Ogawa, Y.; Shinoda, H.; Kitagawa, T.,
Two competing fragmentation processes in dimethoxybenzenes depending on their positional isomers: Elimination of CH3 and CHnO (n = 1-3) and formation of methoxycyclopentadienyl and protonated phenol ions,
Org. Mass Spectrom., 1992, 27, 578. [all data]
Tait, Shannon, et al., 1962
Tait, J.M.S.; Shannon, T.W.; Harrison, A.G.,
The structure of substituted C7 ions from benzyl derivatives at the appearance potential threshold,
J. Am. Chem. Soc., 1962, 84, 4. [all data]