Disilane, ethylpentamethyl-
- Formula: C7H20Si2
- Molecular weight: 160.4047
- IUPAC Standard InChIKey: AIYNVZFMBDWFLW-UHFFFAOYSA-N
- CAS Registry Number: 15063-64-6
- Chemical structure:
View 3d structure (requires JavaScript / HTML 5) - Other names: 1-Ethyl-1,1,2,2,2-pentamethyldisilane; Ethylpentamethyldisilane

Gas phase ion energetics data

Data compiled by: Henry M. Rosenstock, Keith Draxl, Bruce W. Steiner, and John T. Herron
Appearance energy determinations
Ion | AE (eV) | Other Products | Method | Reference | Comment |
---|---|---|---|---|---|
C3H9Si+ | 10.1 ± 0.1 | ? | EI | Davidson and Stephenson, 1967 | |
C4H11Si+ | 9.7 ± 0.1 | ? | EI | Davidson and Stephenson, 1967 |

References

Davidson and Stephenson, 1967
Davidson, I.M.T.; Stephenson, I.L.,
Appearance potentials of trialkylsilyl ions,
J. Organometal. Chem., 1967, 7, 24. [all data]