Triazene
- Formula: H3N3
- Molecular weight: 45.0439
- IUPAC Standard InChIKey: AYNNSCRYTDRFCP-UHFFFAOYSA-N
- CAS Registry Number: 15056-34-5
- Chemical structure:
View 3d structure (requires JavaScript / HTML 5) - Permanent link for this species. Use this link for bookmarking this species for future reference.

Gas phase ion energetics data

Data compiled by: Henry M. Rosenstock, Keith Draxl, Bruce W. Steiner, and John T. Herron
Ionization energy determinations
IE (eV) | Method | Reference |
---|---|---|
9.6 ± 0.1 | EI | Foner and Hudson, 1958 |

References

Foner and Hudson, 1958
Foner, S.N.; Hudson, R.L.,
Mass spectrometric detection of triazene and tetrazene and studies of the free radicals NH2, and N2H3,
J. Chem. Phys., 1958, 29, 442. [all data]