DL-Phenylalanine
- Formula: C9H11NO2
- Molecular weight: 165.1891
- IUPAC Standard InChIKey: COLNVLDHVKWLRT-UHFFFAOYSA-N
- CAS Registry Number: 150-30-1
- Chemical structure:
View 3d structure (requires JavaScript / HTML 5) - Stereoisomers:
- Other names: DL-β-Phenylalanine; β-Phenylalanine, dl-; (.+/-.)-Phenylalanine; Alanine, phenyl-, DL-; DL-α-Amino-β-phenylpropionic acid; DL-β-Phenyl-α-alanine; DL-2-Amino-3-phenylpropanoic acid; DL-3-Phenylalanine; DLPA; 2-Amino-3-phenylpropionic acid, dl-; NSC 9959; Phenylalanine; L-Phenylalanine

Condensed phase thermochemistry data

Data compiled by: Hussein Y. Afeefy, Joel F. Liebman, and Stephen E. Stein
Quantity | Value | Units | Method | Reference | Comment |
---|---|---|---|---|---|
ΔfH°solid | -460.6 ± 2.6 | kJ/mol | Ccb | Breitenbach, Derkosch, et al., 1952 | Reanalyzed by Cox and Pilcher, 1970, Original value = -459.0 kJ/mol |
Quantity | Value | Units | Method | Reference | Comment |
ΔcH°solid | -4653.0 ± 2.5 | kJ/mol | Ccb | Breitenbach, Derkosch, et al., 1952 | Reanalyzed by Cox and Pilcher, 1970, Original value = -4653.9 kJ/mol |
ΔcH°solid | -4664.3 | kJ/mol | Ccb | Fischer and Wrede, 1904 | Heat of combustion corrected for pressure |

Reaction thermochemistry data

Data compiled by: Robert C. Dunbar
Individual Reactions
By formula: Na+ + C9H11NO2 = (Na+ • C9H11NO2)
Quantity | Value | Units | Method | Reference | Comment |
---|---|---|---|---|---|
ΔrH° | 198. ± 13. | kJ/mol | IMRE | Gapeev and Dunbar, 2003 | Anchor glycine=38.5+-2.5 |
ΔrH° | 198. | kJ/mol | CIDC | Kish, Ohanessian, et al., 2003 | Anchor alanine=39.89 |

Gas phase ion energetics data

Data evaluated as indicated in comments:
L - Sharon G. Lias
Data compiled as indicated in comments:
LL - Sharon G. Lias and Joel F. Liebman
LBLHLM - Sharon G. Lias, John E. Bartmess, Joel F. Liebman, John L. Holmes, Rhoda D. Levin, and W. Gary Mallard
RDSH - Henry M. Rosenstock, Keith Draxl, Bruce W. Steiner, and John T. Herron
Quantity | Value | Units | Method | Reference | Comment |
---|---|---|---|---|---|
IE (evaluated) | 8.4 | eV | N/A | N/A | L |
Ionization energy determinations
IE (eV) | Method | Reference | Comment |
---|---|---|---|
8.5 | PE | Campbell, Marzluff, et al., 1994 | LL |
8.4 | PE | Cannington and Ham, 1983 | LBLHLM |
≤8.4 | PI | Akopyan and Loginov, 1967 | RDSH |
8.9 | PE | Campbell, Marzluff, et al., 1994 | Vertical value; LL |
9.4 | PE | Cannington and Ham, 1983 | Vertical value; LBLHLM |

Ion clustering data

Data compiled by: Robert C. Dunbar
Clustering reactions
By formula: Na+ + C9H11NO2 = (Na+ • C9H11NO2)
Quantity | Value | Units | Method | Reference | Comment |
---|---|---|---|---|---|
ΔrH° | 198. ± 13. | kJ/mol | IMRE | Gapeev and Dunbar, 2003 | Anchor glycine=38.5+-2.5 |
ΔrH° | 198. | kJ/mol | CIDC | Kish, Ohanessian, et al., 2003 | Anchor alanine=39.89 |

References

Breitenbach, Derkosch, et al., 1952
Breitenbach, J.W.; Derkosch, J.; Wessely, F.,
Energetik der bildung hochmolekularer polypeptide,
Monatsh. Chem., 1952, 83, 591. [all data]
Cox and Pilcher, 1970
Cox, J.D.; Pilcher, G.,
Thermochemistry of Organic and Organometallic Compounds, Academic Press, New York, 1970, 1-636. [all data]
Fischer and Wrede, 1904
Fischer, E.; Wrede, F.,
Uber die Verbrennungswarme einiger organischer Verbindungen,
Sitzungsber. Dtsch. Akad. Wiss. Berlin Kl. Math. Phys. Tech., 1904, 687-715. [all data]
Gapeev and Dunbar, 2003
Gapeev, A.; Dunbar, R.C.,
Na+ Affinities of Gas-Phase Amino Acids by Ligand Exchange Equilibrium,
Int. J. Mass Spectrom., 2003, 228, 2-3, 825, https://doi.org/10.1016/S1387-3806(03)00242-2
. [all data]
Kish, Ohanessian, et al., 2003
Kish, M.M.; Ohanessian, G.; Wesdemiotis, C.,
The Na+ affinities of a-amino acids: side-chain substituent effects,
Int. J. Mass Spectrom., 2003, 227, 3, 509, https://doi.org/10.1016/S1387-3806(03)00082-4
. [all data]
Campbell, Marzluff, et al., 1994
Campbell, S.; Marzluff, E.M.; Rodgers, M.T.; Beauchamp, J.L.; Rempe, M.E.; Schwinck, K.F.; Lichtenberger, D.L.,
Proton affinities and photoelectron spectra of phenylalanine and N-methyl and N,N-dimethylphenylalanine. Correlation of lone pair ionization energies with proton affinities and implications for N-methylation as a method to effect site specific protonation of peptides,
J. Am. Chem. Soc., 1994, 116, 5257. [all data]
Cannington and Ham, 1983
Cannington, P.H.; Ham, N.S.,
He(I) and He(II) photoelectron spectra of glycine and related molecules,
J. Electron Spectrosc. Relat. Phenom., 1983, 32, 139. [all data]
Akopyan and Loginov, 1967
Akopyan, M.E.; Loginov, Yy.V.,
Mass-spectrometric study of the phoionization of free α-aminoacids,
High Energy Chem., 1967, 1, 83, In original 97. [all data]