Cyclooctane, methyl-
- Formula: C9H18
- Molecular weight: 126.2392
- IUPAC Standard InChIKey: POCNHGFJLGYFIK-UHFFFAOYSA-N
- CAS Registry Number: 1502-38-1
- Chemical structure:
View 3d structure (requires JavaScript / HTML 5) - Other names: Methylcyclooctane

Phase change data

Data compiled by: Thermodynamics Research Center, NIST Boulder Laboratories, Chris Muzny director
Quantity | Value | Units | Method | Reference | Comment |
---|---|---|---|---|---|
Tfus | 288. | K | N/A | Godchot, 1934 | Uncertainty assigned by TRC = 5. K |

Reaction thermochemistry data

Data compiled by: Hussein Y. Afeefy, Joel F. Liebman, and Stephen E. Stein
Individual Reactions
By formula: H2 + C9H16 = C9H18
Quantity | Value | Units | Method | Reference | Comment |
---|---|---|---|---|---|
ΔrH° | -147. | kJ/mol | Chyd | Roth, Adamczak, et al., 1991 | liquid phase |

Gas phase ion energetics data

Data compiled by: Sharon G. Lias and Joel F. Liebman
Ionization energy determinations
IE (eV) | Method | Reference |
---|---|---|
9.70 ± 0.05 | EI | Holmes and Lossing, 1991 |

Kovats' RI, non-polar column, isothermal

Column type | Active phase | Temperature (C) | I | Reference | Comment |
---|---|---|---|---|---|
Capillary | Squalane | 100. | 995. | Schomburg, 1967 | Ar; Column length: 100. m |
Capillary | Squalane | 100. | 992. | Schomburg, 1966 | |
Capillary | Squalane | 120. | 999. | Schomburg, 1966 | |
Packed | Apiezon L | 130. | 1019. | Wehrli and Kováts, 1959 | Celite; Column length: 2.25 m |

Kovats' RI, non-polar column, temperature ramp

Column type | Active phase | I | Reference | Comment |
---|---|---|---|---|
Capillary | Apiezon L | 1009. | Louis, 1971 | N2, 1. K/min; Column length: 50. m; Column diameter: 0.25 mm; Tstart: 60. C |

References

Godchot, 1934
Godchot, M.,
New research in the Cyclanic Series,
Bull. Soc. Chim. Fr., 1934, 1, 1153. [all data]
Roth, Adamczak, et al., 1991
Roth, W.R.; Adamczak, O.; Breuckmann, R.; Lennartz, H.-W.; Boese, R.,
Die Berechnung von Resonanzenergien; das MM2ERW-Kraftfeld,
Chem. Ber., 1991, 124, 2499-2521. [all data]
Holmes and Lossing, 1991
Holmes, J.L.; Lossing, F.P.,
Ionization energies of homologous organic compounds and correlation with molecular size,
Org. Mass Spectrom., 1991, 26, 537. [all data]
Schomburg, 1967
Schomburg, G.,
Struktur und Retentionsverhalten von Offenkettigen und Cyclischen Kohlenwasserstoffen und Deren Einfacher Substitutionsprodukte,
Anal. Chim. Acta., 1967, 38, 45-64, https://doi.org/10.1016/S0003-2670(01)80560-2
. [all data]
Schomburg, 1966
Schomburg, G.,
Gaschromatographische Retentionsdaten und struktur chemischer verbindungen. III. Alkylverzweigte und ungesättigte cyclische Kohlenwasserstoffe,
J. Chromatogr., 1966, 23, 18-41, https://doi.org/10.1016/S0021-9673(01)98653-4
. [all data]
Wehrli and Kováts, 1959
Wehrli, A.; Kováts, E.,
Gas-chromatographische Charakterisierung ogranischer Verbindungen. Teil 3: Berechnung der Retentionsindices aliphatischer, alicyclischer und aromatischer Verbindungen,
Helv. Chim. Acta, 1959, 7, 7, 2709-2736, https://doi.org/10.1002/hlca.19590420745
. [all data]
Louis, 1971
Louis, R.,
Kovats-index-tafeln zur gaschromatographischen analyse von kohlenwasserstoffgemischen,
Erdoel Kohle Erdgas Petrochem., 1971, 24, 2, 88-94. [all data]