Cyclodecanone
- Formula: C10H18O
- Molecular weight: 154.2493
- IUPAC Standard InChIKey: SXOZDDAFVJANJP-UHFFFAOYSA-N
- CAS Registry Number: 1502-06-3
- Chemical structure:
View 3d structure (requires JavaScript / HTML 5) - Permanent link for this species. Use this link for bookmarking this species for future reference.

Gas phase thermochemistry data

Data compiled by: Hussein Y. Afeefy, Joel F. Liebman, and Stephen E. Stein
Quantity | Value | Units | Method | Reference | Comment |
---|---|---|---|---|---|
ΔfH°gas | -305.1 ± 1.9 | kJ/mol | Ccb | Wolf, 1972 |

Condensed phase thermochemistry data

Data compiled by: Hussein Y. Afeefy, Joel F. Liebman, and Stephen E. Stein
Quantity | Value | Units | Method | Reference | Comment |
---|---|---|---|---|---|
ΔfH°liquid | -363.4 ± 1.8 | kJ/mol | Ccb | Wolf, 1972 | |
Quantity | Value | Units | Method | Reference | Comment |
ΔcH°liquid | -6144.3 ± 1.7 | kJ/mol | Ccb | Wolf, 1972 | Corresponding ΔfHºliquid = -363.32 kJ/mol (simple calculation by NIST; no Washburn corrections) |
ΔcH°liquid | -6166.4 | kJ/mol | Ccb | Skuratov, Kozina, et al., 1958 | Corresponding ΔfHºliquid = -341. kJ/mol (simple calculation by NIST; no Washburn corrections) |

Phase change data

Data compiled as indicated in comments:
TRC - Thermodynamics Research Center, NIST Boulder Laboratories, Chris Muzny director
BS - Robert L. Brown and Stephen E. Stein
ALS - Hussein Y. Afeefy, Joel F. Liebman, and Stephen E. Stein
AC - William E. Acree, Jr., James S. Chickos
Quantity | Value | Units | Method | Reference | Comment |
---|---|---|---|---|---|
Tboil | 509.2 | K | N/A | Wolf, 1972, 2 | Uncertainty assigned by TRC = 1.5 K; TRC |
Quantity | Value | Units | Method | Reference | Comment |
Tfus | 296.0 | K | N/A | Wolf, 1972, 2 | Uncertainty assigned by TRC = 0.1 K; TRC |
Quantity | Value | Units | Method | Reference | Comment |
ΔvapH° | 58.37 ± 0.63 | kJ/mol | V | Wolf, 1972 | ALS |
ΔvapH° | 58.4 ± 0.6 | kJ/mol | N/A | Wolf, 1972 | AC |
Reduced pressure boiling point
Tboil (K) | Pressure (bar) | Reference | Comment |
---|---|---|---|
379.7 | 0.016 | Aldrich Chemical Company Inc., 1990 | BS |
379. | 0.016 | Farchan Laboratories, 1990 | BS |
Enthalpy of vaporization
ΔvapH (kJ/mol) | Temperature (K) | Method | Reference | Comment |
---|---|---|---|---|
55.2 | 368. | A | Stephenson and Malanowski, 1987 | Based on data from 353. to 423. K.; AC |
Enthalpy of fusion
ΔfusH (kJ/mol) | Temperature (K) | Reference | Comment |
---|---|---|---|
24.3 | 294.9 | Gonthier-Vassal and Szwarc, 1998 | AC |

Gas phase ion energetics data

Data compiled by: Sharon G. Lias, John E. Bartmess, Joel F. Liebman, John L. Holmes, Rhoda D. Levin, and W. Gary Mallard
Ionization energy determinations
IE (eV) | Method | Reference | Comment |
---|---|---|---|
9.19 | PE | Spanka and Rademacher, 1986 | Vertical value |

Kovats' RI, non-polar column, isothermal

Column type | Active phase | Temperature (C) | I | Reference | Comment |
---|---|---|---|---|---|
Packed | OV-101 | 220. | 1380.3 | Didaoui, Touabet, et al., 1997 | N2, Chromosorb G HP; Column length: 2. m |
Capillary | SE-30 | 220. | 1369.7 | Didaoui, Touabet, et al., 1997 | 27. m/0.4 mm/1.13 μm, N2, Chromosorb G HP |
Capillary | SE-30 | 200. | 1375.7 | Didaoui, Touabet, et al., 1997 | 27. m/0.4 mm/0.1 μm, N2, Chromosorb G HP |
Capillary | Apolane | 220. | 1378.5 | Didaoui, Touabet, et al., 1997 | 43. m/0.29 mm/0.28 μm, N2 |
Packed | Apolane | 220. | 1390.6 | Didaoui, Touabet, et al., 1997 | 2. m/0.29 mm/0.28 μm, N2, Chromosorb G HP |

Van Den Dool and Kratz RI, polar column, temperature ramp

Column type | Active phase | I | Reference | Comment |
---|---|---|---|---|
Capillary | CP-Wax 52CB | 1723. | Wu and Liou, 1992 | H2, 50. C @ 10. min, 1.5 K/min, 200. C @ 80. min; Column length: 50. m; Column diameter: 0.32 mm |

Normal alkane RI, polar column, temperature ramp

Column type | Active phase | I | Reference | Comment |
---|---|---|---|---|
Capillary | DB-Wax | 1726. | Beck, Higbee, et al., 2008 | 60. m/0.32 mm/0.25 μm, Helium, 30. C @ 4. min, 2. K/min, 200. C @ 30. min |
Capillary | DB-Wax | 1744. | Beck, Higbee, et al., 2008 | 60. m/0.32 mm/0.25 μm, Helium, 30. C @ 4. min, 2. K/min, 200. C @ 30. min |

References

Wolf, 1972
Wolf, G.,
Thermochemische Untersuchungen an cyclischen Ketonen,
Helv. Chim. Acta, 1972, 55, 1446-1459. [all data]
Skuratov, Kozina, et al., 1958
Skuratov, S.M.; Kozina, M.P.; Shtocher, S.M.; Prevalova, N.M.; Kamkina, L.S.; Zuko, V.D.,
Heats of combustion of cyclic compounds,
Bull. Chem. Thermodyn., 1958, 1, 21. [all data]
Wolf, 1972, 2
Wolf, G.,
Thermochemical studies of cyclic ketones,
Helv. Chim. Acta, 1972, 55, 1446. [all data]
Aldrich Chemical Company Inc., 1990
Aldrich Chemical Company Inc.,
Catalog Handbook of Fine Chemicals, Aldrich Chemical Company, Inc., Milwaukee WI, 1990, 1. [all data]
Farchan Laboratories, 1990
Farchan Laboratories,
Research Chemicals Catalog, Farchan Laboratories, Gainesville, FL, 1990, 91. [all data]
Stephenson and Malanowski, 1987
Stephenson, Richard M.; Malanowski, Stanislaw,
Handbook of the Thermodynamics of Organic Compounds, 1987, https://doi.org/10.1007/978-94-009-3173-2
. [all data]
Gonthier-Vassal and Szwarc, 1998
Gonthier-Vassal, Anne; Szwarc, Henri,
Thermodynamic properties of cycloketones: A DSC study,
Thermochimica Acta, 1998, 320, 1-2, 141-154, https://doi.org/10.1016/S0040-6031(98)00409-2
. [all data]
Spanka and Rademacher, 1986
Spanka, G.; Rademacher, P.,
Transannular interactions in difunctional medium rings. 1. n/π Interactions in cyclic amino ketones and aminoalkenes studied by photoelectron spectroscopy,
J. Org. Chem., 1986, 51, 592. [all data]
Didaoui, Touabet, et al., 1997
Didaoui, L.; Touabet, A.; Meklati, B.Y.,
Comparison of mathematical methods for the calculation of retention indices at high temperature in gas chromatography,
J. Hi. Res. Chromatogr., 1997, 20, 11, 605-610, https://doi.org/10.1002/jhrc.1240201107
. [all data]
Wu and Liou, 1992
Wu, C.-M.; Liou, S.-E.,
Volatile components of water-boiled duck meat and Cantonese style roasted duck,
J. Agric. Food Chem., 1992, 40, 5, 838-841, https://doi.org/10.1021/jf00017a026
. [all data]
Beck, Higbee, et al., 2008
Beck, J.J.; Higbee, B.S.; Marrill, G.B.; Roitman, J.N.,
Comparison of volatile emissions from undamaged and mechanically damaged almonds,
J, Sci. Food Argic., 2008, 88, 8, 1363-1368, https://doi.org/10.1002/jsfa.3224
. [all data]