(Z)-1,3-Pentadiene, 2-methyl-
- Formula: C6H10
- Molecular weight: 82.1436
- IUPAC Standard InChIKey: RCJMVGJKROQDCB-PLNGDYQASA-N
- CAS Registry Number: 1501-60-6
- Chemical structure:
View 3d structure (requires JavaScript / HTML 5) - Stereoisomers:
- Other names: 2-Methyl-1, cis-3-pentadiene; 1,3-Pentadiene, 2-methyl-, (Z)-

Reaction thermochemistry data

Data compiled by: Hussein Y. Afeefy, Joel F. Liebman, and Stephen E. Stein
Individual Reactions
By formula: C6H10 = C6H10
Quantity | Value | Units | Method | Reference | Comment |
---|---|---|---|---|---|
ΔrH° | -17.20 | kJ/mol | Eqk | Petrova-Kuminskaya, Roganov, et al., 1984 | gas phase; At 458 K, see Petrova-Kuminskaya, Roganov, et al., 1984, 2 |
By formula: C6H10 = C6H10
Quantity | Value | Units | Method | Reference | Comment |
---|---|---|---|---|---|
ΔrH° | -16.11 | kJ/mol | Eqk | Petrova-Kuminskaya, Roganov, et al., 1984 | gas phase; At 458 K, see Petrova-Kuminskaya, Roganov, et al., 1984, 2 |

Gas phase ion energetics data

Data compiled by: Sharon G. Lias and Joel F. Liebman
Ionization energy determinations
IE (eV) | Method | Reference | Comment |
---|---|---|---|
8.65 ± 0.025 | PE | Werstiuk and Timmins, 1988 | Vertical value |

Kovats' RI, non-polar column, isothermal

Column type | Active phase | Temperature (C) | I | Reference | Comment |
---|---|---|---|---|---|
Packed | Squalane | 70. | 602. | Safina, Poznyak, et al., 1989 | He, Risorb (0.2-0.3 mm); Column length: 2. m |
Capillary | Squalane | 50. | 603.3 | Bajus, Veselý, et al., 1979 | Column length: 100. m; Column diameter: 0.25 mm |
Capillary | Squalane | 70. | 602.9 | Bajus, Veselý, et al., 1979 | Column length: 100. m; Column diameter: 0.25 mm |
Packed | Squalane | 27. | 626. | Hively and Hinton, 1968 | He, Chromosorb P; Column length: 15. m; Column diameter: 0.25 mm |
Packed | Squalane | 49. | 628. | Hively and Hinton, 1968 | He, Chromosorb P; Column length: 15. m; Column diameter: 0.25 mm |
Packed | Squalane | 67. | 629. | Hively and Hinton, 1968 | He, Chromosorb P; Column length: 15. m; Column diameter: 0.25 mm |
Packed | Squalane | 86. | 629. | Hively and Hinton, 1968 | He, Chromosorb P; Column length: 15. m; Column diameter: 0.25 mm |
Packed | Squalane | 27. | 600. | Hively and Hinton, 1968 | He, Chromosorb P; Column length: 15. m; Column diameter: 0.25 mm |
Packed | Squalane | 49. | 601. | Hively and Hinton, 1968 | He, Chromosorb P; Column length: 15. m; Column diameter: 0.25 mm |
Packed | Squalane | 67. | 602. | Hively and Hinton, 1968 | He, Chromosorb P; Column length: 15. m; Column diameter: 0.25 mm |
Packed | Squalane | 86. | 602. | Hively and Hinton, 1968 | He, Chromosorb P; Column length: 15. m; Column diameter: 0.25 mm |

References

Petrova-Kuminskaya, Roganov, et al., 1984
Petrova-Kuminskaya, S.V.; Roganov, G.N.; Kabo, G.Ya.,
Enthalpies of formation and isomerization of alkadienes,
Probl. Kalorim. Khim. Termodin., Dokl. Vses. Konf., 10th, 1984, 1, 234-236. [all data]
Petrova-Kuminskaya, Roganov, et al., 1984, 2
Petrova-Kuminskaya, S.V.; Roganov, G.N.; Kabo, G.Ya.,
Equilibrium of isomerization of 2-methylpentadienes,
Neftekhimiya, 1984, 24, 485-490. [all data]
Werstiuk and Timmins, 1988
Werstiuk, N.; Timmins, G.,
A redetermination of the ultraviolet photoelectron spectrum of (Z)-2-methyl-1,3-pentadiene; evidence that twisted conformers predominate in the gas phase,
Can. J. Chem., 1988, 66, 2954. [all data]
Safina, Poznyak, et al., 1989
Safina, L.R.; Poznyak, T.I.; Lisitsyn, D.M.; Kiseleva, E.V.; Kovalev, G.I.,
Selective gas-chromatographic determination of trace unsaturated and aromatic-hydrocarbons in complex-mixtures,
J. Appl. Chem. USSR (Engl. Transl.), 1989, 44, 5, 749-754. [all data]
Bajus, Veselý, et al., 1979
Bajus, M.; Veselý, V.; Leclercq, P.A.; Rijks, J.A.,
Steam cracking of hydrocarbons. 2. Pyrolysis of methylcyclohexane,
Ind. Eng. Chem. Prod. Res. Dev., 1979, 18, 2, 135-142, https://doi.org/10.1021/i360070a012
. [all data]
Hively and Hinton, 1968
Hively, R.A.; Hinton, R.E.,
Variation of the retention index with temperature on squalane substrates,
J. Gas Chromatogr., 1968, 6, 4, 203-217, https://doi.org/10.1093/chromsci/6.4.203
. [all data]