Pyridine, 2-nitro-
- Formula: C5H4N2O2
- Molecular weight: 124.0975
- IUPAC Standard InChIKey: HLTDBMHJSBSAOM-UHFFFAOYSA-N
- CAS Registry Number: 15009-91-3
- Chemical structure:
View 3d structure (requires JavaScript / HTML 5) - Other names: 2-Nitropyridine

Phase change data

Data compiled by: Robert L. Brown and Stephen E. Stein
Quantity | Value | Units | Method | Reference | Comment |
---|---|---|---|---|---|
Tboil | 529.2 | K | N/A | Weast and Grasselli, 1989 |

Gas phase ion energetics data

Data compiled by: Sharon G. Lias, Rhoda D. Levin, and Sherif A. Kafafi
Ionization energy determinations
IE (eV) | Method | Reference |
---|---|---|
10.1 ± 0.1 | EI | Stefanovic and Grutzmacher, 1974 |

References

Weast and Grasselli, 1989
CRC Handbook of Data on Organic Compounds, 2nd Editon, Weast,R.C and Grasselli, J.G., ed(s)., CRC Press, Inc., Boca Raton, FL, 1989, 1. [all data]
Stefanovic and Grutzmacher, 1974
Stefanovic, D.; Grutzmacher, H.F.,
The ionisation potential of some substituted pyridines,
Org. Mass Spectrom., 1974, 9, 1052. [all data]