Bicyclo[2.2.1]hept-2-ene,7-(1-methylethylidene)-
- Formula: C10H14
- Molecular weight: 134.2182
- IUPAC Standard InChIKey: LUOGQGXSVQQCOL-UHFFFAOYSA-N
- CAS Registry Number: 14995-50-7
- Chemical structure:
View 3d structure (requires JavaScript / HTML 5) - Permanent link for this species. Use this link for bookmarking this species for future reference.

Gas phase ion energetics data

Data compiled by: Sharon G. Lias, Rhoda D. Levin, and Sherif A. Kafafi
Ionization energy determinations
IE (eV) | Method | Reference |
---|---|---|
8.27 | PE | Heilbronner and Martin, 1972 |

References

Heilbronner and Martin, 1972
Heilbronner, E.; Martin, H.D.,
The π-orbital sequence in norbornadiene and related hydrocarbons,
Helv. Chim. Acta, 1972, 55, 1490. [all data]