Monochlorine monoxide
- Formula: ClO
- Molecular weight: 51.452
- IUPAC Standard InChIKey: NHYCGSASNAIGLD-UHFFFAOYSA-N
- CAS Registry Number: 14989-30-1
- Chemical structure:
View 3d structure (requires JavaScript / HTML 5) - Permanent link for this species. Use this link for bookmarking this species for future reference.

Reaction thermochemistry data

Data compiled by: John E. Bartmess
Individual Reactions
(CAS Reg. No. 80424-04-0 • 4294967295) +
= CAS Reg. No. 80424-04-0
By formula: (CAS Reg. No. 80424-04-0 • 4294967295ClO) + ClO = CAS Reg. No. 80424-04-0
Quantity | Value | Units | Method | Reference | Comment |
---|---|---|---|---|---|
ΔrH° | 312. ± 5.9 | kJ/mol | N/A | Distelrath and Boesl, 2000 | gas phase; Reassignment of bands from Gilles, Polak, et al., 1992 |
ΔrH° | 334. ± 5.9 | kJ/mol | Ther | Gilles, Polak, et al., 1992 | gas phase |

Gas phase ion energetics data

Data evaluated as indicated in comments:
L - Sharon G. Lias
Data compiled as indicated in comments:
LL - Sharon G. Lias and Joel F. Liebman
LLK - Sharon G. Lias, Rhoda D. Levin, and Sherif A. Kafafi
RDSH - Henry M. Rosenstock, Keith Draxl, Bruce W. Steiner, and John T. Herron
B - John E. Bartmess
Quantity | Value | Units | Method | Reference | Comment |
---|---|---|---|---|---|
IE (evaluated) | 10.89 ± 0.02 | eV | N/A | N/A | L |
Electron affinity determinations
EA (eV) | Method | Reference | Comment |
---|---|---|---|
2.2775 ± 0.0013 | ZEKE | Distelrath and Boesl, 2000 | B |
2.2760 ± 0.0060 | LPES | Gilles, Polak, et al., 1992 | B |
2.35 ± 0.15 | EIAE | Baluev, Nikitin, et al., 1980 | From Cl2O; B |
2.17 ± 0.23 | LPD | Lee, Smith, et al., 1979 | B |
1.95 ± 0.25 | IMRB | Dotan, Albritton, et al., 1978 | B |
>1.62 ± 0.22 | R-A | Vogt, Dreves, et al., 1977 | Cl- + O2 ->.; B |
Ionization energy determinations
IE (eV) | Method | Reference | Comment |
---|---|---|---|
10.885 ± 0.016 | PI | Thorn, Stief, et al., 1996 | LL |
11.08 ± 0.05 | EI | Alekseev, Zyubina, et al., 1989 | LL |
11.0 | EVAL | Huber and Herzberg, 1979 | LLK |
10.95 | PE | Bulgin, Dyke, et al., 1979 | LLK |
11.1 ± 0.1 | EI | Fisher, 1967 | RDSH |
11.01 ± 0.01 | PE | Bulgin, Dyke, et al., 1979 | Vertical value; LLK |

Gas phase thermochemistry data

Quantity | Value | Units | Method | Reference | Comment |
---|---|---|---|---|---|
ΔfH°gas | 101.22 | kJ/mol | Review | Chase, 1998 | Data last reviewed in December, 1992 |
Quantity | Value | Units | Method | Reference | Comment |
S°gas,1 bar | 226.65 | J/mol*K | Review | Chase, 1998 | Data last reviewed in December, 1992 |
Gas Phase Heat Capacity (Shomate Equation)
Cp° = A + B*t + C*t2 + D*t3 +
E/t2
H° − H°298.15= A*t + B*t2/2 +
C*t3/3 + D*t4/4 − E/t + F − H
S° = A*ln(t) + B*t + C*t2/2 + D*t3/3 −
E/(2*t2) + G
Cp = heat capacity (J/mol*K)
H° = standard enthalpy (kJ/mol)
S° = standard entropy (J/mol*K)
t = temperature (K) / 1000.
View plot Requires a JavaScript / HTML 5 canvas capable browser.
Temperature (K) | 298. to 600. | 600. to 6000. |
---|---|---|
A | 18.71767 | 36.99648 |
B | 59.07975 | 0.748572 |
C | -73.82291 | -0.067520 |
D | 34.56222 | 0.005234 |
E | 0.076445 | -0.787617 |
F | 93.85298 | 87.75229 |
G | 235.0906 | 267.4350 |
H | 101.2189 | 101.2189 |
Reference | Chase, 1998 | Chase, 1998 |
Comment | Data last reviewed in December, 1992 | Data last reviewed in December, 1992 |

Constants of diatomic molecules

Data compiled by: Klaus P. Huber and Gerhard H. Herzberg
Data collected through September, 1976
Symbol | Meaning |
---|---|
State | electronic state and / or symmetry symbol |
Te | minimum electronic energy (cm-1) |
ωe | vibrational constant – first term (cm-1) |
ωexe | vibrational constant – second term (cm-1) |
ωeye | vibrational constant – third term (cm-1) |
Be | rotational constant in equilibrium position (cm-1) |
αe | rotational constant – first term (cm-1) |
γe | rotation-vibration interaction constant (cm-1) |
De | centrifugal distortion constant (cm-1) |
βe | rotational constant – first term, centrifugal force (cm-1) |
re | internuclear distance (Å) |
Trans. | observed transition(s) corresponding to electronic state |
ν00 | position of 0-0 band (units noted in table) |
State | Te | ωe | ωexe | ωeye | Be | αe | γe | De | βe | re | Trans. | ν00 |
---|---|---|---|---|---|---|---|---|---|---|---|---|
Several unclassified absorption bands in the region 67000 - 79000 cm-1. | ||||||||||||
↳Basco and Morse, 1973 | ||||||||||||
H | (74125) | (1025) H | H ← X V | 74212 H | ||||||||
↳Basco and Morse, 1973 | ||||||||||||
G (2Π) | 73913 | 1075 H | 10 | G ← X V | 73705 H | |||||||
↳missing citation | ||||||||||||
73878 | 1075 H | 10 | G ← X V | 73986 H | ||||||||
↳missing citation | ||||||||||||
State | Te | ωe | ωexe | ωeye | Be | αe | γe | De | βe | re | Trans. | ν00 |
F (2Σ) | 69109 | [1001] 1 H | F ← X V | 68869 H | ||||||||
↳missing citation | ||||||||||||
69109 | [1001] 1 H | F ← X V | 69181 H | |||||||||
↳missing citation | ||||||||||||
E (2Σ) | 67333 | 1070 H | 4 | E ← X V | 67120 H | |||||||
↳missing citation | ||||||||||||
67333 | 1070 H | 4 | E ← X V | 67445 H | ||||||||
↳missing citation | ||||||||||||
State | Te | ωe | ωexe | ωeye | Be | αe | γe | De | βe | re | Trans. | ν00 |
D (2Σ) | 64486 | 1050 H | 2 | D ← X V | 64269 H | |||||||
↳missing citation | ||||||||||||
64486 | 1050 H | 2 | D ← X V | 64582 H | ||||||||
↳missing citation | ||||||||||||
C (2Σ) | 58448 | 1062 H | 3 | C ← X V | 58234 H | |||||||
↳missing citation | ||||||||||||
58448 | 1062 H | 3 | C ← X V | 58554 H | ||||||||
↳missing citation | ||||||||||||
State | Te | ωe | ωexe | ωeye | Be | αe | γe | De | βe | re | Trans. | ν00 |
A 2Πi | 32169 | 519.5 Z | 7.2 2 | -0.11 | 0.4450 3 | 0.006 | 0.000024 | [1.31E-6] | 1.858 | A ↔ X R | 31682.9 4 Z | |
↳Pannetier and Gaydon, 1948; Porter, 1950; missing citation; missing citation; missing citation; missing citation | ||||||||||||
31650 | 519.5 Z | 7.2 2 | -0.11 | 0.4450 3 | 0.006 | 0.000024 | [1.31E-6] | 1.858 | A ↔ X R | 31482.3 4 Z | ||
↳Pannetier and Gaydon, 1948; Porter, 1950; missing citation; missing citation; missing citation; missing citation | ||||||||||||
X 2Πi | 318 5 | 853.8 6 Z | 5.5 | -0.02 | 0.623448 7 | 0.0058 | 0.000016 | [1.33E-6] | 1.56963 8 | |||
↳Andrews and Raymond, 1971; Chi and Andrews, 1973 | ||||||||||||
0 | 853.8 6 Z | 5.5 | -0.02 | 0.623448 7 | 0.0058 | 0.000016 | [1.33E-6] | 1.56963 9 | ||||
↳Amano, Hirota, et al., 1968; Amano, Saito, et al., 1969 | ||||||||||||
EPR sp. 10 | ||||||||||||
↳Carrington, Dyer, et al., 1967; Carrington, Levy, et al., 1967; Uehara and Morino, 1970; Uehara, Tanimoto, et al., 1971 |

References

Distelrath and Boesl, 2000
Distelrath, V.; Boesl, U.,
Mass selective gas phase study of ClO, OClO, ClOO and ClAr by anion-ZEKE-photoelectron spectroscopy,
Faraday Disc. Chem. Soc., 2000, 115, 161-174, https://doi.org/10.1039/a909618c
. [all data]
Gilles, Polak, et al., 1992
Gilles, M.K.; Polak, M.L.; Lineberger, W.C.,
Photoelectron Spectroscopy of the Halogen Oxide Anions FO-, ClO-, BrO-, IO-, OClO-, and OIO-,
J. Chem. Phys., 1992, 96, 11, 8012, https://doi.org/10.1063/1.462352
. [all data]
Baluev, Nikitin, et al., 1980
Baluev, A.V.; Nikitin, I.M.; Fedorova, L.I.; Rossolovskii, V.Ya.,
Mass Spectrometric Study of Chlorine Pentafluoride Ionization by Electron Impact, Izv. Akad. Nauk SSR Ser. Khim. 487, 1980. [all data]
Lee, Smith, et al., 1979
Lee, L.C.; Smith, G.P.; Moseley, J.T.; Cosby, P.C.; Guest, J.A.,
Photodissociation and photodetachment of Cl2-, ClO-, Cl3-, and BrCl2-,
J. Chem. Phys., 1979, 70, 3237. [all data]
Dotan, Albritton, et al., 1978
Dotan, I.; Albritton, D.L.; Fehsenfeld, F.C.; Streit, G.E.; Ferguson, E.E.,
Rate constants for the reactions of O-, O2-, NO2-, CO3-, and CO4- with HCl and ClO- with NO, NO2, SO2, and CO2 at 300K,
J. Chem. Phys., 1978, 68, 5414. [all data]
Vogt, Dreves, et al., 1977
Vogt, D.; Dreves, W.; Mischke, J.,
Energy dependence of differential cross sections in endoergic ion-molecule collision processes of negative ions,
Int. J. Mass Spectrom. Ion Phys., 1977, 24, 285. [all data]
Thorn, Stief, et al., 1996
Thorn, R.P., Jr.; Stief, L.J.; Kuo, S.-C.; Klemm, R.B.,
Ionization energy of Cl2O and ClO, appearance energy of ClO+(Cl2O), and heat of formation of Cl2O,
J. Phys. Chem., 1996, 100, 14178. [all data]
Alekseev, Zyubina, et al., 1989
Alekseev, V.I.; Zyubina, T.S.; Zyubin, A.S.; Baluev, A.V.,
Mass-spectrometric and quantum-chemical investigation of thermochemical characteristics of chlorine oxides,
J. Am. Chem. Soc., 1989, 2092. [all data]
Huber and Herzberg, 1979
Huber, K.P.; Herzberg, G.,
Molecular Spectra and Molecular Structure. IV. Constants of Diatomic Molecules,, Van Nostrand Reinhold Co., 1979, ,1. [all data]
Bulgin, Dyke, et al., 1979
Bulgin, D.K.; Dyke, J.M.; Jonathan, N.; Morris, A.,
Vacuum ultraviolet photoelectron spectroscopy of transient species,
J. Chem. Soc. Faraday Trans. 2, 1979, 75, 456. [all data]
Fisher, 1967
Fisher, I.P.,
Mass spectrometry study of intermediates in thermal decomposition of perchloric acid and chlorine dioxide,
J. Chem. Soc. Faraday Trans., 1967, 63, 684. [all data]