Ethyl dichlorophosphate
- Formula: C2H5Cl2O2P
- Molecular weight: 162.940
- IUPAC Standard InChIKey: YZBOZNXACBQJHI-UHFFFAOYSA-N
- CAS Registry Number: 1498-51-7
- Chemical structure:
View 3d structure (requires JavaScript / HTML 5) - Species with the same structure:
- Other names: Phosphorodichloridic acid, ethyl ester; Dichloroethoxyphosphine oxide; Dichlorophosphoric acid, ethyl ester; Ethyl phosphorodichloridate; Ethylphosphoric acid dichloride; Ethoxyphosphoryl dichloride; Ethyl dichlorophosphinate; Ethyl phosphoryl dichloride; NSC 87531

Gas phase ion energetics data

Data compiled by: Sharon G. Lias, Rhoda D. Levin, and Sherif A. Kafafi
Ionization energy determinations
IE (eV) | Method | Reference | Comment |
---|---|---|---|
11.42 | PE | Furlani and Andreocci, 1977 | Vertical value |
11.46 | PE | Vovna, Lopatin, et al., 1975 | Vertical value |

References

Furlani and Andreocci, 1977
Furlani, C.; Andreocci, M.V.,
Valence-shell photoionization spectra of some methyldihalogenophosphates,
J. Chem. Soc. Dalton Trans., 1977, 7, 673. [all data]
Vovna, Lopatin, et al., 1975
Vovna, V.I.; Lopatin, S.N.; Pettsol'd, R.; Vilesov, F.I.,
Photoelectron spectra and electronic structure of some phosphoryl compounds,
Khim. Vys. Energ., 1975, 9, 9. [all data]