Nitrosodifluoroamine
- Formula: F2N2O
- Molecular weight: 82.0096
- IUPAC Standard InChIKey: DKTSNLZDRQDHBO-UHFFFAOYSA-N
- CAS Registry Number: 14984-78-2
- Chemical structure:
View 3d structure (requires JavaScript / HTML 5) - Permanent link for this species. Use this link for bookmarking this species for future reference.

Gas phase ion energetics data

Data compiled by: Henry M. Rosenstock, Keith Draxl, Bruce W. Steiner, and John T. Herron
Appearance energy determinations
Ion | AE (eV) | Other Products | Method | Reference | Comment |
---|---|---|---|---|---|
NF2+ | 12.12 ± 0.12 | NO | EI | Cristy and Mamantov, 1970 |

References

Cristy and Mamantov, 1970
Cristy, S.S.; Mamantov, G.,
Cryogenic mass spectrometry of reactive fluorine-containing species. II. Applications to synthesis via pyrolysis, photolysis and microwave discharge,
Intern. J. Mass Spectrom. Ion Phys., 1970, 5, 319. [all data]