Methane, trimethoxy-
- Formula: C4H10O3
- Molecular weight: 106.1204
- IUPAC Standard InChIKey: PYOKUURKVVELLB-UHFFFAOYSA-N
- CAS Registry Number: 149-73-5
- Chemical structure:
View 3d structure (requires JavaScript / HTML 5) - Other names: Orthoformic acid, trimethyl ester; Methyl orthoformate; Orthoformic acid methyl ester; Trimethoxymethane; Trimethyl orthoformate; CH(OCH3)3; Methylester kyseliny orthomravenci; Orthomravencan methylnaty; Trimethylester kyseliny orthomravenci; Methoxymethylal; NSC 147479

Gas phase thermochemistry data

Data compiled by: Hussein Y. Afeefy, Joel F. Liebman, and Stephen E. Stein
Quantity | Value | Units | Method | Reference | Comment |
---|---|---|---|---|---|
ΔfH°gas | -127.10 ± 0.77 | kcal/mol | Cm | Hine and Klueppet, 1974 | Reanalyzed by Pedley, Naylor, et al., 1986, Original value = -127.7 ± 0.77 kcal/mol |
ΔfH°gas | -127.13 ± 0.61 | kcal/mol | Ccb | Pihlaja and Tuomi, 1971 | Reanalyzed by Pedley, Naylor, et al., 1986, Original value = -128.41 ± 0.67 kcal/mol |

Condensed phase thermochemistry data

Data compiled by: Hussein Y. Afeefy, Joel F. Liebman, and Stephen E. Stein
Quantity | Value | Units | Method | Reference | Comment |
---|---|---|---|---|---|
ΔfH°liquid | -135.96 ± 0.21 | kcal/mol | Cm | Hine and Klueppet, 1974 | Reanalyzed by Pedley, Naylor, et al., 1986, Original value = -136.8 kcal/mol |
ΔfH°liquid | -137.51 ± 0.47 | kcal/mol | Ccb | Pihlaja and Tuomi, 1971 | |
Quantity | Value | Units | Method | Reference | Comment |
ΔcH°liquid | -580.27 ± 0.47 | kcal/mol | Ccb | Pihlaja and Tuomi, 1971 | Corresponding ΔfHºliquid = -137.51 kcal/mol (simple calculation by NIST; no Washburn corrections) |

Phase change data

Data compiled as indicated in comments:
BS - Robert L. Brown and Stephen E. Stein
ALS - Hussein Y. Afeefy, Joel F. Liebman, and Stephen E. Stein
DRB - Donald R. Burgess, Jr.
AC - William E. Acree, Jr., James S. Chickos
Quantity | Value | Units | Method | Reference | Comment |
---|---|---|---|---|---|
Tboil | 374.7 | K | N/A | Aldrich Chemical Company Inc., 1990 | BS |
Tboil | 377.2 | K | N/A | Weast and Grasselli, 1989 | BS |
Quantity | Value | Units | Method | Reference | Comment |
ΔvapH° | 9.13 | kcal/mol | V | Hine and Klueppet, 1974 | ALS |
ΔvapH° | 8.87 | kcal/mol | N/A | Hine and Klueppet, 1974 | DRB |
ΔvapH° | 9.10 ± 0.20 | kcal/mol | C | Pihlaja and Tuomi, 1971 | ALS |
ΔvapH° | 10.4 | kcal/mol | N/A | Pihlaja and Tuomi, 1971 | DRB |
ΔvapH° | 9.1 ± 0.2 | kcal/mol | N/A | Pihlaja and Tuomi, 1971 | AC |
Enthalpy of vaporization
ΔvapH (kcal/mol) | Temperature (K) | Method | Reference | Comment |
---|---|---|---|---|
9.3 | 288. | A | Stephenson and Malanowski, 1987 | Based on data from 273. to 358. K.; AC |

Reaction thermochemistry data

Data compiled by: Hussein Y. Afeefy, Joel F. Liebman, and Stephen E. Stein
Individual Reactions
By formula: C4H10O3 + H2O = C2H4O2 + 2CH4O
Quantity | Value | Units | Method | Reference | Comment |
---|---|---|---|---|---|
ΔrH° | -2.29 ± 0.28 | kcal/mol | Cm | Hine and Klueppet, 1974 | liquid phase |

Henry's Law data

Data compiled by: Rolf Sander
Henry's Law constant (water solution)
kH(T) = k°H exp(d(ln(kH))/d(1/T) ((1/T) - 1/(298.15 K)))
k°H = Henry's law constant for solubility in water at 298.15 K (mol/(kg*bar))
d(ln(kH))/d(1/T) = Temperature dependence constant (K)
k°H (mol/(kg*bar)) | d(ln(kH))/d(1/T) (K) | Method | Reference |
---|---|---|---|
69. | V | N/A |

Gas phase ion energetics data

Data evaluated as indicated in comments:
L - Sharon G. Lias
Data compiled as indicated in comments:
LBLHLM - Sharon G. Lias, John E. Bartmess, Joel F. Liebman, John L. Holmes, Rhoda D. Levin, and W. Gary Mallard
LLK - Sharon G. Lias, Rhoda D. Levin, and Sherif A. Kafafi
RDSH - Henry M. Rosenstock, Keith Draxl, Bruce W. Steiner, and John T. Herron
Quantity | Value | Units | Method | Reference | Comment |
---|---|---|---|---|---|
IE (evaluated) | 9.5 | eV | N/A | N/A | L |
Ionization energy determinations
IE (eV) | Method | Reference | Comment |
---|---|---|---|
~9.5 | EI | Holmes and Lossing, 1982 | LBLHLM |
9.5 | PE | Gan, Peel, et al., 1977 | LLK |
10.24 ± 0.07 | PE | Gan, Peel, et al., 1977 | Vertical value; LLK |
Appearance energy determinations
Ion | AE (eV) | Other Products | Method | Reference | Comment |
---|---|---|---|---|---|
C3H7O2+ | 10.36 ± 0.06 | CH3O | EI | Martin, Lampe, et al., 1966 | RDSH |
C4H9O3+ | 10.22 | H | EI | Holmes and Lossing, 1982 | LBLHLM |
C4H9O3+ | 10.39 ± 0.05 | H | EI | Martin, Lampe, et al., 1966 | RDSH |

Kovats' RI, non-polar column, isothermal

View large format table.

Column type Active phase Temperature (C) I Reference Comment
PackedApiezon L120.654.Bogoslovsky, Anvaer, et al., 1978Celite 545
PackedApiezon L160.660.Bogoslovsky, Anvaer, et al., 1978Celite 545

Normal alkane RI, non-polar column, temperature ramp

View large format table.

Column type Active phase I Reference Comment
CapillaryOV-101702.Zenkevich, 200525. m/0.20 mm/0.10 μm, N2/He, 6. K/min; Tstart: 50. C; Tend: 250. C

References

Hine and Klueppet, 1974
Hine, J.; Klueppet, A.W.,
Structural effects on rates and equilibria. XVIII. Thermodynamic stability of ortho esters,
J. Am. Chem. Soc., 1974, 96, 2924-2929. [all data]
Pedley, Naylor, et al., 1986
Pedley, J.B.; Naylor, R.D.; Kirby, S.P.,
Thermochemical Data of Organic Compounds, Chapman and Hall, New York, 1986, 1-792. [all data]
Pihlaja and Tuomi, 1971
Pihlaja, K.; Tuomi, M.,
Bond-bond interactions in organic oxygen compounds. Part V. Enthalpies of formation of methyl and ethyl orthoformates and the contributory group increments. The magnitude of the so-called rabbit-ear effect in acyclic oxygen compounds,
Acta Chem. Scand., 1971, 25, 465-469. [all data]
Aldrich Chemical Company Inc., 1990
Aldrich Chemical Company Inc.,
Catalog Handbook of Fine Chemicals, Aldrich Chemical Company, Inc., Milwaukee WI, 1990, 1. [all data]
Weast and Grasselli, 1989
CRC Handbook of Data on Organic Compounds, 2nd Editon, Weast,R.C and Grasselli, J.G., ed(s)., CRC Press, Inc., Boca Raton, FL, 1989, 1. [all data]
Stephenson and Malanowski, 1987
Stephenson, Richard M.; Malanowski, Stanislaw,
Handbook of the Thermodynamics of Organic Compounds, 1987, https://doi.org/10.1007/978-94-009-3173-2
. [all data]
Holmes and Lossing, 1982
Holmes, J.L.; Lossing, F.P.,
Towards a general scheme for estimating the heats of formation of organic ions in the gas phase. Part II. The effect of substitution at charge-bearing sites,
Can. J. Chem., 1982, 60, 2365. [all data]
Gan, Peel, et al., 1977
Gan, T.H.; Peel, J.B.; Willett, G.D.,
A comparison of the photoelectron spectra of the trimethyl- and triallylorthoformates,
Chem. Phys. Lett., 1977, 51, 464. [all data]
Martin, Lampe, et al., 1966
Martin, R.H.; Lampe, F.W.; Taft, R.W.,
An electron-impact study of ionization and dissociation in methoxy- and halogen- substituted methanes,
J. Am. Chem. Soc., 1966, 88, 1353. [all data]