Trichlorogermane, trifluoromethyl-
- Formula: CCl3F3Ge
- Molecular weight: 248.00
- CAS Registry Number: 1495-36-9

Gas phase ion energetics data

Data compiled by: Sharon G. Lias, John E. Bartmess, Joel F. Liebman, John L. Holmes, Rhoda D. Levin, and W. Gary Mallard
Ionization energy determinations
IE (eV) | Method | Reference | Comment |
---|---|---|---|
11.5 | PE | Drake, Gorzelska, et al., 1982 | |
11.80 | PE | Drake, Gorzelska, et al., 1982 | Vertical value |

References

Drake, Gorzelska, et al., 1982
Drake, J.E.; Gorzelska, K.; White, G.S.; Eujen, R.,
Photoelectron spectra of trifluoromethyl(bromo)- and trifluoromethyl(chloro)-germanes (CF3)4-nGeXn (X = Br, Cl n = 1-3),
J. Electron Spectrosc. Relat. Phenom., 1982, 26, 1. [all data]