Methane, dichlorofluoronitroso-
- Formula: CCl2FNO
- Molecular weight: 131.921
- IUPAC Standard InChIKey: LRVFUYBONDNIOA-UHFFFAOYSA-N
- CAS Registry Number: 1495-28-9
- Chemical structure:
View 3d structure (requires JavaScript / HTML 5) - Permanent link for this species. Use this link for bookmarking this species for future reference.

Gas phase ion energetics data

Data compiled by: Sharon G. Lias, Rhoda D. Levin, and Sherif A. Kafafi
Appearance energy determinations
Ion | AE (eV) | Other Products | Method | Reference | Comment |
---|---|---|---|---|---|
CCl2FNO+ | 10.58 ± 0.05 | ? | PE | Ernsting, Pfab, et al., 1980 | Vertical value |

References

Ernsting, Pfab, et al., 1980
Ernsting, N.P.; Pfab, J.; Green, J.C.; Romelt, J.,
Photoelectron spectra of nitrosomethane, t-nitrosobutane and some perhalogenonitrosomethanes,
J. Chem. Soc. Faraday Trans. 2, 1980, 76, 844. [all data]