Water-d
- Formula: DHO
- Molecular weight: 19.0214
- IUPAC Standard InChIKey: XLYOFNOQVPJJNP-DYCDLGHISA-N
- CAS Registry Number: 14940-63-7
- Chemical structure:
View 3d structure (requires JavaScript / HTML 5) - Isotopologues:
- Other names: Water-D1; HDO

Gas phase thermochemistry data

Quantity | Value | Units | Method | Reference | Comment |
---|---|---|---|---|---|
ΔfH°gas | -245.37 | kJ/mol | Review | Chase, 1998 | Data last reviewed in June, 1977 |
Quantity | Value | Units | Method | Reference | Comment |
S°gas,1 bar | 199.52 | J/mol*K | Review | Chase, 1998 | Data last reviewed in June, 1977 |
Gas Phase Heat Capacity (Shomate Equation)
Cp° = A + B*t + C*t2 + D*t3 +
E/t2
H° − H°298.15= A*t + B*t2/2 +
C*t3/3 + D*t4/4 − E/t + F − H
S° = A*ln(t) + B*t + C*t2/2 + D*t3/3 −
E/(2*t2) + G
Cp = heat capacity (J/mol*K)
H° = standard enthalpy (kJ/mol)
S° = standard entropy (J/mol*K)
t = temperature (K) / 1000.
View plot Requires a JavaScript / HTML 5 canvas capable browser.
Temperature (K) | 298. to 1500. | 1500. to 6000. |
---|---|---|
A | 28.02025 | 46.52943 |
B | 13.79716 | 6.256126 |
C | 3.742058 | -1.020035 |
D | -2.416101 | 0.062807 |
E | 0.123292 | -10.86413 |
F | -253.9504 | -278.3398 |
G | 229.8627 | 233.7948 |
H | -245.3711 | -245.3711 |
Reference | Chase, 1998 | Chase, 1998 |
Comment | Data last reviewed in June, 1977 | Data last reviewed in June, 1977 |

Gas phase ion energetics data

Data compiled by: Sharon G. Lias, Rhoda D. Levin, and Sherif A. Kafafi
Ionization energy determinations
IE (eV) | Method | Reference |
---|---|---|
12.630 | PE | Botter and Carlier, 1977 |

Vibrational and/or electronic energy levels

Data compiled by: Takehiko Shimanouchi
Symmetry: Cs Symmetry Number σ = 1
Sym. | No | Approximate | Selected Freq. | Infrared | Raman | Comments | ||||
---|---|---|---|---|---|---|---|---|---|---|
Species | type of mode | Value | Rating | Value | Phase | Value | Phase | |||
a' | 1 | OD str | 2727 | A | 2726.73 | gas | 2718 | gas | ||
a' | 2 | Bend | 1402 | A | 1402.20 | gas | ||||
a' | 3 | OH str | 3707 | A | 3707.47 | gas | ||||
Source: Shimanouchi, 1972

References

Chase, 1998
Chase, M.W., Jr.,
NIST-JANAF Themochemical Tables, Fourth Edition,
J. Phys. Chem. Ref. Data, Monograph 9, 1998, 1-1951. [all data]
Botter and Carlier, 1977
Botter, R.; Carlier, J.,
Spectre de photoelectrons et calcul des facteurs de Franck-Condon pour H2O, D2O, HDO,
J. Electron Spectrosc. Relat. Phenom., 1977, 12, 55. [all data]
Shimanouchi, 1972
Shimanouchi, T.,
Tables of Molecular Vibrational Frequencies Consolidated Volume I, National Bureau of Standards, 1972, 1-160. [all data]