Distibane
- Formula: H4Sb2
- Molecular weight: 247.552
- IUPAC Standard InChIKey: FMBZMVISYSZRSF-UHFFFAOYSA-N
- CAS Registry Number: 14939-42-5
- Chemical structure:
View 3d structure (requires JavaScript / HTML 5) - Permanent link for this species. Use this link for bookmarking this species for future reference.

Gas phase ion energetics data

Data compiled by: Henry M. Rosenstock, Keith Draxl, Bruce W. Steiner, and John T. Herron
Appearance energy determinations
Ion | AE (eV) | Other Products | Method | Reference | Comment |
---|---|---|---|---|---|
Sb2H+ | 10.9 ± 0.3 | H2+H | EI | Saalfeld and Svec, 1963 | |
Sb2H2+ | 10.7 ± 0.3 | H2 | EI | Saalfeld and Svec, 1963 | |
Sb2H3+ | 10.5 ± 0.3 | H | EI | Saalfeld and Svec, 1963 | |
Sb2H4+ | 10.2 ± 0.3 | ? | EI | Saalfeld and Svec, 1963 | |
Sb+ | 11.5 ± 0.3 | ? | EI | Saalfeld and Svec, 1963 | |
Sb2+ | 11.2 ± 0.3 | 2H2 | EI | Saalfeld and Svec, 1963 |

References

Saalfeld and Svec, 1963
Saalfeld, F.E.; Svec, H.J.,
The mass spectra of volatile hydrides. II. Some higher hydrides of the group IVB and VB elements,
Inorg. Chem., 1963, 2, 50. [all data]