Bis(dimethylamino)methylphosphine
- Formula: C5H15N2P
- Molecular weight: 134.1598
- IUPAC Standard InChIKey: PUFUNWGTWSVVRT-UHFFFAOYSA-N
- CAS Registry Number: 14937-39-4
- Chemical structure:
View 3d structure (requires JavaScript / HTML 5) - Other names: Phosphine, bis(dimethylamino)-methyl-

Gas phase ion energetics data

Data compiled by: Sharon G. Lias, John E. Bartmess, Joel F. Liebman, John L. Holmes, Rhoda D. Levin, and W. Gary Mallard
Ionization energy determinations
IE (eV) | Method | Reference | Comment |
---|---|---|---|
7.80 | PE | Zverev, Vakar, et al., 1986 | Vertical value |

References

Zverev, Vakar, et al., 1986
Zverev, V.V.; Vakar, V.M.; Villem, Y.Y.; Villen, N.V.; Karelov, A.A.,
Photoelectron spectra and electronic structures of organophosphorus compounds. Timethylsilyl phosphites and amidophosphites,
J. Gen. Chem. USSR, 1986, 56, 1807. [all data]