Methanethiol, trifluoro-
- Formula: CHF3S
- Molecular weight: 102.079
- IUPAC Standard InChIKey: MFLLMKMFWIUACU-UHFFFAOYSA-N
- CAS Registry Number: 1493-15-8
- Chemical structure:
View 3d structure (requires JavaScript / HTML 5) - Other names: Perfluoromethanethiol; Trifluoromethanethiol; Trifluoromethylmercaptan

Condensed phase thermochemistry data

Data compiled by: Eugene S. Domalski and Elizabeth D. Hearing
Quantity | Value | Units | Method | Reference | Comment |
---|---|---|---|---|---|
S°liquid | 204.60 | J/mol*K | N/A | Dininny and Pace, 1960 |
Constant pressure heat capacity of liquid
Cp,liquid (J/mol*K) | Temperature (K) | Reference | Comment |
---|---|---|---|
113.09 | 235. | Dininny and Pace, 1960 | T = 12 to 227 K. |

Phase change data

Data compiled as indicated in comments:
AC - William E. Acree, Jr., James S. Chickos
DH - Eugene S. Domalski and Elizabeth D. Hearing
Enthalpy of vaporization
ΔvapH (kJ/mol) | Temperature (K) | Method | Reference | Comment |
---|---|---|---|---|
21.8 | 183. | N/A | Dykyj, Svoboda, et al., 1999 | Based on data from 167. to 236. K.; AC |
21.0 | 221. | A | Stephenson and Malanowski, 1987 | Based on data from 167. to 236. K. See also Dykyj, Svoboda, et al., 1999.; AC |
Enthalpy of fusion
ΔfusH (kJ/mol) | Temperature (K) | Reference | Comment |
---|---|---|---|
4.925 | 116.04 | Dininny and Pace, 1960 | DH |
4.93 | 116. | Domalski and Hearing, 1996 | AC |
Entropy of fusion
ΔfusS (J/mol*K) | Temperature (K) | Reference | Comment |
---|---|---|---|
42.43 | 116.04 | Dininny and Pace, 1960 | DH |

Reaction thermochemistry data

Data compiled by: John E. Bartmess
Individual Reactions
CF3S- + =
By formula: CF3S- + H+ = CHF3S
Quantity | Value | Units | Method | Reference | Comment |
---|---|---|---|---|---|
ΔrH° | 1400. ± 9.6 | kJ/mol | G+TS | Koppel, Pihl, et al., 1994 | gas phase; Possibly dissociative protonation -> CF2S + HF + A-. See CF3O-. G2: 321.0, Burk, Koppel, et al., 2000 |
Quantity | Value | Units | Method | Reference | Comment |
ΔrG° | 1370. ± 8.4 | kJ/mol | IMRE | Koppel, Pihl, et al., 1994 | gas phase; Possibly dissociative protonation -> CF2S + HF + A-. See CF3O-. G2: 321.0, Burk, Koppel, et al., 2000 |

Gas phase ion energetics data

Data compiled as indicated in comments:
B - John E. Bartmess
RDSH - Henry M. Rosenstock, Keith Draxl, Bruce W. Steiner, and John T. Herron
Ionization energy determinations
IE (eV) | Method | Reference | Comment |
---|---|---|---|
11.4 ± 0.1 | EI | Cullen, Frost, et al., 1969 | RDSH |
De-protonation reactions
CF3S- + =
By formula: CF3S- + H+ = CHF3S
Quantity | Value | Units | Method | Reference | Comment |
---|---|---|---|---|---|
ΔrH° | 1400. ± 9.6 | kJ/mol | G+TS | Koppel, Pihl, et al., 1994 | gas phase; Possibly dissociative protonation -> CF2S + HF + A-. See CF3O-. G2: 321.0, Burk, Koppel, et al., 2000; B |
Quantity | Value | Units | Method | Reference | Comment |
ΔrG° | 1370. ± 8.4 | kJ/mol | IMRE | Koppel, Pihl, et al., 1994 | gas phase; Possibly dissociative protonation -> CF2S + HF + A-. See CF3O-. G2: 321.0, Burk, Koppel, et al., 2000; B |

References

Dininny and Pace, 1960
Dininny, R.E.; Pace, E.L.,
Thermodynamic properties of trifluoromethanethiol from 12°K to its boiling point. Entropy from molecular and spectroscopic data,
J. Chem. Phys., 1960, 32, 805-809. [all data]
Dykyj, Svoboda, et al., 1999
Dykyj, J.; Svoboda, J.; Wilhoit, R.C.; Frenkel, M.L.; Hall, K.R.,
Vapor Pressure of Chemicals: Part A. Vapor Pressure and Antoine Constants for Hydrocarbons and Sulfur, Selenium, Tellurium and Hydrogen Containing Organic Compounds, Springer, Berlin, 1999, 373. [all data]
Stephenson and Malanowski, 1987
Stephenson, Richard M.; Malanowski, Stanislaw,
Handbook of the Thermodynamics of Organic Compounds, 1987, https://doi.org/10.1007/978-94-009-3173-2
. [all data]
Domalski and Hearing, 1996
Domalski, Eugene S.; Hearing, Elizabeth D.,
Heat Capacities and Entropies of Organic Compounds in the Condensed Phase. Volume III,
J. Phys. Chem. Ref. Data, 1996, 25, 1, 1, https://doi.org/10.1063/1.555985
. [all data]
Koppel, Pihl, et al., 1994
Koppel, I.A.; Pihl, V.; Koppel, I.A.; Anvia, F.; Taft, R.W.,
Thermodynamic acidity of (CF3)3CH and 1H-undecafluorobicyclo[2.2.1]heptane: The concept of anionic (fluorine) hyperconjugation,
J. Am. Chem. Soc., 1994, 116, 19, 8654, https://doi.org/10.1021/ja00098a027
. [all data]
Burk, Koppel, et al., 2000
Burk, P.; Koppel, I.A.; Rummel, A.; Trummal, A.,
Can O-H acid be more acidic than its S-H analog? A G2 study of fluoromethanols and fluoromethanethiols,
J. Phys. Chem. A, 2000, 104, 7, 1602-1607, https://doi.org/10.1021/jp993487a
. [all data]
Cullen, Frost, et al., 1969
Cullen, W.R.; Frost, D.C.; Vroom, D.A.,
Ionization potentials of some sulfur compounds,
Inorg. Chem., 1969, 8, 1803. [all data]