2-Mercaptobenzothiazole
- Formula: C7H5NS2
- Molecular weight: 167.251
- IUPAC Standard InChIKey: YXIWHUQXZSMYRE-UHFFFAOYSA-N
- CAS Registry Number: 149-30-4
- Chemical structure:
View 3d structure (requires JavaScript / HTML 5) - Other names: 2(3H)-Benzothiazolethione; 2-Benzothiazolethiol; Accel M; Accelerator M; Benzothiazole, mercapto-; Benzothiazolethiol; Captax; Dermacid; Ekagom G; Kaptaks; Kaptax; Mebetizole; Mebithizol; Mercaptobenzothiazol; Mercaptobenzothiazole; Mercaptobenzthiazole; Mertax; MBT; Nuodeb 84; Pneumax MBT; Rotax; Royal MBT; Soxinol M; Thiotax; Vulkacit M; Vulkacit Mercapto; Vulkacit Mercapto/C; 2-Benzothiazolinethione; 2-Mercaptobenzthiazole; 2-MBT; AG 63; Sulfadene; USAF GY-3; USAF XR-29; 2-Mercptobenzothiazole; 2-Merkaptobenzotiazol; 2-Merkaptobenzthiazol; NCI-C56519; Pennac mbt powder; Rokon; Benzothiazole-2-thione; 2-Benzothiazolyl mercaptan; Nocceler M; Accelerator Mercapto; Perkacit MBT; Benzothiazole, 2-mercapto-; 1,3-Benzothiazole-2-thione; Benzo[d]thiazole-2-thiol; 2-Mercaptobenzothiazole (2-MBT); benzothiazole-2-thiol

Phase change data

Data compiled as indicated in comments:
TRC - Thermodynamics Research Center, NIST Boulder Laboratories, Chris Muzny director
AC - William E. Acree, Jr., James S. Chickos
Quantity | Value | Units | Method | Reference | Comment |
---|---|---|---|---|---|
Tfus | 454.75 | K | N/A | Witschonke, 1954 | Uncertainty assigned by TRC = 0.3 K; TRC |
Tfus | 455.15 | K | N/A | Witschonke, 1954 | Uncertainty assigned by TRC = 0.2 K; TRC |
Enthalpy of fusion
ΔfusH (kJ/mol) | Temperature (K) | Method | Reference | Comment |
---|---|---|---|---|
20.56 | 453.5 | DSC | Mentado, Flores, et al., 2008 | AC |
22.3 ± 0.2 | 455.9 | DSC | Temprado, Roux, et al., 2008 | AC |

Gas phase ion energetics data

Data compiled by: Sharon G. Lias, Rhoda D. Levin, and Sherif A. Kafafi
Ionization energy determinations
IE (eV) | Method | Reference |
---|---|---|
7.99 | PE | Guimon, Arbelot, et al., 1975 |

Normal alkane RI, non-polar column, custom temperature program

Column type | Active phase | I | Reference | Comment |
---|---|---|---|---|
Capillary | SE-30 | 1944. | Vinogradov, 2004 | Program: not specified |

References

Witschonke, 1954
Witschonke, C.R.,
Freezing point and purity data for some organic compounds,
Anal. Chem., 1954, 26, 562-4. [all data]
Mentado, Flores, et al., 2008
Mentado, Juan; Flores, Henoc; Amador, Patricia,
Combustion energies and formation enthalpies of 2-SH-benzazoles,
The Journal of Chemical Thermodynamics, 2008, 40, 7, 1106-1109, https://doi.org/10.1016/j.jct.2008.02.018
. [all data]
Temprado, Roux, et al., 2008
Temprado, Manuel; Roux, Maria Victoria; Parameswar, Archana R.; Demchenko, Alexei V.; Chickos, James S.; Liebman, Joel F.,
Thermophysical properties in medium temperature range of several thio and dithiocarbamates,
J Therm Anal Calorim, 2008, 91, 2, 471-475, https://doi.org/10.1007/s10973-007-8345-8
. [all data]
Guimon, Arbelot, et al., 1975
Guimon, C.; Arbelot, M.; Pfister-Guillouzo, G.,
Structure electronique de derives sulfures-VIII. Spectres photoelectroniques et electroniques d'J. Heterocycl. Chem. thiocarbonyles benzo-substitues,
Spectrochim. Acta Part A, 1975, 31, 985. [all data]
Vinogradov, 2004
Vinogradov, B.A.,
Production, composition, properties and application of essential oils, 2004, retrieved from http://viness.narod.ru. [all data]