Formyl fluoride
- Formula: CHFO
- Molecular weight: 48.0164
- CAS Registry Number: 1493-02-3

Phase change data

Data compiled by: William E. Acree, Jr., James S. Chickos
Enthalpy of vaporization
ΔvapH (kJ/mol) | Temperature (K) | Method | Reference | Comment |
---|---|---|---|---|
24.4 | 220. | A | Stephenson and Malanowski, 1987 | Based on data from 178. to 235. K. See also Fischer and Buchanan, 1964 and Dykyj, 1970. |

Gas phase ion energetics data

Data compiled as indicated in comments:
B - John E. Bartmess
LLK - Sharon G. Lias, Rhoda D. Levin, and Sherif A. Kafafi
Ionization energy determinations
IE (eV) | Method | Reference | Comment |
---|---|---|---|
12.37 ± 0.02 | PE | Wittel, 1976 | LLK |
De-protonation reactions
CFO- + = CHFO
Quantity | Value | Units | Method | Reference | Comment |
---|---|---|---|---|---|
ΔrH° | 1475. ± 19. | kJ/mol | EIAE | Karpas and Klein, 1977 | gas phase; From HCOF. G3MP2B3 calculations indicate an EA of ca. 2.3 eV, HOF(A-) 7 kcal/mol less stable.; B |
ΔrH° | 1463. ± 14. | kJ/mol | Acid | Thynne and MacNeil, 1970 | gas phase; From CF2O; B |

Gas phase thermochemistry data

Quantity Value Units Method Reference Comment
Δfgas-376.56kJ/molReviewChase, 1998Data last reviewed in June, 1961
Quantity Value Units Method Reference Comment
gas,1 bar246.52J/mol*KReviewChase, 1998Data last reviewed in June, 1961

Gas Phase Heat Capacity (Shomate Equation)

Cp° = A + B*t + C*t2 + D*t3 + E/t2
H° − H°298.15= A*t + B*t2/2 + C*t3/3 + D*t4/4 − E/t + F − H
S° = A*ln(t) + B*t + C*t2/2 + D*t3/3 − E/(2*t2) + G
    Cp = heat capacity (J/mol*K)
    H° = standard enthalpy (kJ/mol)
    S° = standard entropy (J/mol*K)
    t = temperature (K) / 1000.

View plot Requires a JavaScript / HTML 5 canvas capable browser.

View table.

Temperature (K) 298. - 1000.1000. - 6000.
A 7.47287572.96687
B 125.80335.631162
C -92.35008-1.135579
D 26.693840.078592
E 0.260592-9.843112
F -382.7431-422.0150
G 223.3892301.7626
H -376.5604-376.5604
ReferenceChase, 1998Chase, 1998
Comment Data last reviewed in June, 1961 Data last reviewed in June, 1961

Reaction thermochemistry data

Data compiled by: John E. Bartmess

Individual Reactions

CFO- + Hydrogen cation = CHFO

By formula: CFO- + H+ = CHFO

Quantity Value Units Method Reference Comment
Δr1475. ± 19.kJ/molEIAEKarpas and Klein, 1977gas phase; From HCOF. G3MP2B3 calculations indicate an EA of ca. 2.3 eV, HOF(A-) 7 kcal/mol less stable.
Δr1463. ± 14.kJ/molAcidThynne and MacNeil, 1970gas phase; From CF2O

Fluorine anion + CHFO = (Fluorine anion • CHFO)

By formula: F- + CHFO = (F- • CHFO)

Quantity Value Units Method Reference Comment
Δr>75.73kJ/molIMRBKarpas and Klein, 1977gas phase; FCO- + HCFO ->. Computations indicate HOF(A-) ca. -134, dHaff ca. 33 kcal/mol

Henry's Law data

Data compiled by: Rolf Sander

Henry's Law constant (water solution)

kH(T) = H exp(d(ln(kH))/d(1/T) ((1/T) - 1/(298.15 K)))
H = Henry's law constant for solubility in water at 298.15 K (mol/(kg*bar))
d(ln(kH))/d(1/T) = Temperature dependence constant (K)

H (mol/(kg*bar)) d(ln(kH))/d(1/T) (K) Method Reference Comment
3.0 EN/A

Ion clustering data

Data compiled by: John E. Bartmess

Clustering reactions

Fluorine anion + CHFO = (Fluorine anion • CHFO)

By formula: F- + CHFO = (F- • CHFO)

Quantity Value Units Method Reference Comment
Δr>75.73kJ/molIMRBKarpas and Klein, 1977gas phase; FCO- + HCFO ->. Computations indicate HOF(A-) ca. -134, dHaff ca. 33 kcal/mol

References

Stephenson and Malanowski, 1987
Stephenson, Richard M.; Malanowski, Stanislaw,
Handbook of the Thermodynamics of Organic Compounds, 1987, https://doi.org/10.1007/978-94-009-3173-2
. [all data]
Fischer and Buchanan, 1964
Fischer, G.; Buchanan, AS,
Vapour pressures of formyl fluoride and carbonyl chlorofluoride,
Aust. J. Chem., 1964, 17, 4, 481-621, https://doi.org/10.1071/CH9640481
. [all data]
Dykyj, 1970
Dykyj, J.,
Petrochemica, 1970, 10, 2, 51. [all data]
Wittel, 1976
Wittel, K.,
The photoelectron spectrum of formylfluoride,
J. Electron Spectrosc. Relat. Phenom., 1976, 8, 245. [all data]
Karpas and Klein, 1977
Karpas, Z.; Klein, F.S.,
The gas phase ion chemistry of carbonyl compounds: Formyl fluoride and a binary mixture of H2CO-F2CO or H2CO-Cl2CO,
Int. J. Mass Spectrom. Ion Phys., 1977, 24, 137. [all data]
Thynne and MacNeil, 1970
Thynne, J.C.J.; MacNeil, K.A.G.,
Ionisation and dissociation of carbonyl fluoride and trifluoromethyl hypofluorite by electron impact,
Intern. J. Mass Spectrom. Ion Phys., 1970, 5, 95. [all data]