2,3-dimethylfuran
- Formula: C6H8O
- Molecular weight: 96.1271
- IUPAC Standard InChIKey: FJSKXQVRKZTKSI-UHFFFAOYSA-N
- CAS Registry Number: 14920-89-9
- Chemical structure:
View 3d structure (requires JavaScript / HTML 5) - Permanent link for this species. Use this link for bookmarking this species for future reference.

Phase change data

Data compiled as indicated in comments:
TRC - Thermodynamics Research Center, NIST Boulder Laboratories, Chris Muzny director
BS - Robert L. Brown and Stephen E. Stein
Quantity | Value | Units | Method | Reference | Comment |
---|---|---|---|---|---|
Tboil | 367.65 | K | N/A | Scharf and Walters, 1978 | Uncertainty assigned by TRC = 2. K; TRC |
Tboil | 363.65 | K | N/A | Mndzhoyan and Aroyan, 1957 | Uncertainty assigned by TRC = 2. K; TRC |
Reduced pressure boiling point
Tboil (K) | Pressure (bar) | Reference | Comment |
---|---|---|---|
360.2 | 0.960 | Weast and Grasselli, 1989 | BS |
315.2 | 0.153 | Weast and Grasselli, 1989 | BS |

Gas phase ion energetics data

Data compiled as indicated in comments:
LBLHLM - Sharon G. Lias, John E. Bartmess, Joel F. Liebman, John L. Holmes, Rhoda D. Levin, and W. Gary Mallard
RDSH - Henry M. Rosenstock, Keith Draxl, Bruce W. Steiner, and John T. Herron
Ionization energy determinations
IE (eV) | Method | Reference | Comment |
---|---|---|---|
8.25 ± 0.10 | EI | Grutzmacher and Spilker, 1985 | LBLHLM |
8.0 | EI | Varsel, Morrell, et al., 1960 | RDSH |

Van Den Dool and Kratz RI, non-polar column, temperature ramp

Column type | Active phase | I | Reference | Comment |
---|---|---|---|---|
Capillary | BPX-5 | 725. | Ames, Guy, et al., 2001 | 50. m/0.32 mm/0.25 μm, He, 60. C @ 5. min, 4. K/min, 250. C @ 10. min |

Van Den Dool and Kratz RI, polar column, custom temperature program

Column type | Active phase | I | Reference | Comment |
---|---|---|---|---|
Capillary | Carbowax | 953. | Baltes w. and Bochmann G., 1987 | Column diameter: 0.3 mm; Program: not specified |
Capillary | Carbowax | 954. | Baltes w. and Bochmann G., 1987 | Column diameter: 0.3 mm; Program: not specified |
Capillary | Carbowax | 954. | Baltes w. and Bochmann G., 1987 | Column diameter: 0.3 mm; Program: not specified |
Capillary | Carbowax | 955. | Baltes w. and Bochmann G., 1987 | Column diameter: 0.3 mm; Program: not specified |

Normal alkane RI, non-polar column, temperature ramp

Column type | Active phase | I | Reference | Comment |
---|---|---|---|---|
Capillary | DB-1 | 705. | Barrefors, Björkqvist, et al., 1996 | 50. m/0.32 mm/1. μm, 3. K/min; Tstart: -30. C |

References

Scharf and Walters, 1978
Scharf, H.-D.; Walters, E.,
A New Synthesis Principle for Furane Derivatives II. Fragmentation and Recycling Condensation of 1,3-Dioxolane-4-ylium Ions,
Chem. Ber., 1978, 111, 639. [all data]
Mndzhoyan and Aroyan, 1957
Mndzhoyan, A.L.; Aroyan, A.A.,
Dokl. - Akad. Nauk Arm. SSR, 1957, 25, 267. [all data]
Weast and Grasselli, 1989
CRC Handbook of Data on Organic Compounds, 2nd Editon, Weast,R.C and Grasselli, J.G., ed(s)., CRC Press, Inc., Boca Raton, FL, 1989, 1. [all data]
Grutzmacher and Spilker, 1985
Grutzmacher, H.-F.; Spilker, R.,
Loss of CO from 4,6-dimethyl-2-pyrone and 2,6-dimethyl-4-pyrone radical cations,
Org. Mass Spectrom., 1985, 20, 258. [all data]
Varsel, Morrell, et al., 1960
Varsel, C.J.; Morrell, F.A.; Resnik, F.E.; Powell, W.A.,
Qualitative and quantitative analysis of organic compounds. Use of low-voltage mass spectrometry,
Anal. Chem., 1960, 32, 182. [all data]
Ames, Guy, et al., 2001
Ames, J.M.; Guy, R.C.E.; Kipping, G.J.,
Effect of pH, temperature, and moisture on the formation of volatile compounds in glycine/glucose model systems,
J. Agric. Food Chem., 2001, 49, 9, 4315-4323, https://doi.org/10.1021/jf010198m
. [all data]
Baltes w. and Bochmann G., 1987
Baltes w.; Bochmann G.,
Model reactions on roast aroma formation. II. Mass spectrometric identification of furans and furanones from the reaction of serine and threonine with sucrose under the conditions of coffee roasting,
Z. Lebensm. Unters. Forsch., 1987, 184, 179-186. [all data]
Barrefors, Björkqvist, et al., 1996
Barrefors, G.; Björkqvist, S.; Ramnäs, O.; Petersson, G.,
Gas chromatographic separation of volatile furans from birchwood smoke,
J. Chromatogr. A, 1996, 753, 1, 151-155, https://doi.org/10.1016/S0021-9673(96)00534-1
. [all data]