Lanthanum phosphate
- Formula: LaO4P
- Molecular weight: 233.8768
- IUPAC Standard InChIKey: LQFNMFDUAPEJRY-UHFFFAOYSA-K
- CAS Registry Number: 14913-14-5
- Chemical structure:
View 3d structure (requires JavaScript / HTML 5) - Permanent link for this species. Use this link for bookmarking this species for future reference.

Gas phase ion energetics data

Data compiled by: Sharon G. Lias, Rhoda D. Levin, and Sherif A. Kafafi
Appearance energy determinations
Ion | AE (eV) | Other Products | Method | Reference | Comment |
---|---|---|---|---|---|
O2P+ | 10.4 ± 0.5 | ? | EI | Ratkovskii and Butilin, 1973 | |
P+ | 13.0 ± 0.6 | ? | EI | Ratkovskii and Butilin, 1973 |

References

Ratkovskii and Butilin, 1973
Ratkovskii, I.A.; Butilin, B.A.,
Appearance potential of ions in the mass spectrum of LaPO4,
Vestn. Akad. Nauk SSSR, 1973, 5, 115. [all data]