Iron tetracarbonyl diiodide
- Formula: C4FeI2O4
- Molecular weight: 421.694
- CAS Registry Number: 14911-55-8

Phase change data

Data compiled by: José A. Martinho Simões
Quantity | Value | Units | Method | Reference | Comment |
---|---|---|---|---|---|
ΔsubH° | 86.0 ± 4.0 | kJ/mol | TD-HFC | Connor, Demain, et al., 1979 |

Reaction thermochemistry data

Data compiled by: José A. Martinho Simões
Individual Reactions
C4FeI2O4 (cr) = 4 (g) + FeI2 (cr)
By formula: C4FeI2O4 (cr) = 4CO (g) + FeI2 (cr)
Quantity | Value | Units | Method | Reference | Comment |
---|---|---|---|---|---|
ΔrH° | 163.3 ± 1.0 | kJ/mol | TD-HFC | Connor, Demain, et al., 1979 |

Gas phase ion energetics data

Data compiled as indicated in comments:
LLK - Sharon G. Lias, Rhoda D. Levin, and Sherif A. Kafafi
Ionization energy determinations
IE (eV) | Method | Reference | Comment |
---|---|---|---|
8.4 | PE | Levenson, Cihonski, et al., 1975 | LLK |
8.76 | PE | Levenson, Cihonski, et al., 1975 | Vertical value; LLK |

Gas phase thermochemistry data

Data compiled by: José A. Martinho Simões
Quantity | Value | Units | Method | Reference | Comment |
---|---|---|---|---|---|
ΔfH°gas | -635.7 ± 9.4 | kJ/mol | Review | Martinho Simões |

Condensed phase thermochemistry data

Data compiled by: José A. Martinho Simões
Quantity | Value | Units | Method | Reference | Comment |
---|---|---|---|---|---|
ΔfH°solid | -721.7 ± 8.5 | kJ/mol | Review | Martinho Simões |

References

Connor, Demain, et al., 1979
Connor, J.A.; Demain, C.P.; Skinner, H.A.; Zafarani-Moattar, M.T.,
J. Orgnometal. Chem., 1979, 170, 117. [all data]
Levenson, Cihonski, et al., 1975
Levenson, R.A.; Cihonski, J.L.; Milazzo, P.; Ceasar, G.P.,
Photoelectron spectra of Fe(CO)4X2 (X = Br,I). Transition metal analogs of the methylene halides,
Inorg. Chem., 1975, 14, 2578. [all data]