nicotinonitrile 1-oxide
- Formula: C6H4N2O
- Molecular weight: 120.1088
- IUPAC Standard InChIKey: WOOVSQCALYYUDO-UHFFFAOYSA-N
- CAS Registry Number: 14906-64-0
- Chemical structure:
View 3d structure (requires JavaScript / HTML 5) - Other names: 3-cyanopyridine-N-oxide; 3-Pyridinecarbonitrile, 1-oxide

Phase change data

Data compiled by: William E. Acree, Jr., James S. Chickos
Quantity | Value | Units | Method | Reference | Comment |
---|---|---|---|---|---|
ΔsubH° | 24.35 ± 0.48 | kcal/mol | ME | Ribeiro da Silva, 1998 | Based on data from 345. to 392. K. |

Gas phase ion energetics data

Data evaluated as indicated in comments:
HL - Edward P. Hunter and Sharon G. Lias
Data compiled as indicated in comments:
LLK - Sharon G. Lias, Rhoda D. Levin, and Sherif A. Kafafi
Quantity | Value | Units | Method | Reference | Comment |
---|---|---|---|---|---|
Proton affinity (review) | 210.2 | kcal/mol | N/A | Hunter and Lias, 1998 | HL |
Quantity | Value | Units | Method | Reference | Comment |
Gas basicity | 202.5 | kcal/mol | N/A | Hunter and Lias, 1998 | HL |
Ionization energy determinations
IE (eV) | Method | Reference | Comment |
---|---|---|---|
8.93 ± 0.02 | PE | Maier and Muller, 1974 | Vertical value; LLK |

References

Ribeiro da Silva, 1998
Ribeiro da Silva, M.,
Enthalpies of combustion of the pyridine N-oxide derivatives: 4-methyl-, 3-cyano-, 4-cyano-, 3-hydroxy-, 2-carboxy-, 4-carboxy-, and 3-methyl-4-nitro, and of the pyridine derivatives: 2-carboxy-, and 4-carboxy-. The dissociation enthalpies of the N-O bonds,
The Journal of Chemical Thermodynamics, 1998, 30, 7, 869-878, https://doi.org/10.1006/jcht.1998.0353
. [all data]
Hunter and Lias, 1998
Hunter, E.P.; Lias, S.G.,
Evaluated Gas Phase Basicities and Proton Affinities of Molecules: An Update,
J. Phys. Chem. Ref. Data, 1998, 27, 3, 413-656, https://doi.org/10.1063/1.556018
. [all data]
Maier and Muller, 1974
Maier, J.P.; Muller, J.-F.,
Ionisation energies of pyridine N-oxides determined by photoelectron spectroscopy,
J. Chem. Soc. Faraday Trans. 2, 1974, 70, 1991. [all data]