Benzene, 1-methyl-4-[(1-methylethyl)thio]-
- Formula: C10H14S
- Molecular weight: 166.283
- IUPAC Standard InChIKey: LXDBBXHXMUZFBP-UHFFFAOYSA-N
- CAS Registry Number: 14905-81-8
- Chemical structure:
View 3d structure (requires JavaScript / HTML 5) - Other names: Sulfide, isopropyl p-tolyl; Isopropyl p-cresyl sulfide; Isopropyl p-tolyl sulfide

Gas phase ion energetics data

Data compiled by: Sharon G. Lias, Rhoda D. Levin, and Sherif A. Kafafi
Ionization energy determinations
IE (eV) | Method | Reference | Comment |
---|---|---|---|
8.38 | PE | Dewar, Ernstbrunner, et al., 1974 | Vertical value |

References

Dewar, Ernstbrunner, et al., 1974
Dewar, P.S.; Ernstbrunner, E.; Gilmore, J.R.; Godfrey, M.; Mellor, J.M.,
Conformational analysis of alkyl aryl ethers and alkyl aryl sulphides by photoelectron spectroscopy,
Tetrahedron, 1974, 30, 2455. [all data]