1,2,3-Trifluorobenzene
- Formula: C6H3F3
- Molecular weight: 132.0832
- IUPAC Standard InChIKey: AJKNNUJQFALRIK-UHFFFAOYSA-N
- CAS Registry Number: 1489-53-8
- Chemical structure:
View 3d structure (requires JavaScript / HTML 5) - Permanent link for this species. Use this link for bookmarking this species for future reference.

Phase change data

Data compiled by: Robert L. Brown and Stephen E. Stein
Quantity | Value | Units | Method | Reference | Comment |
---|---|---|---|---|---|
Tboil | 367.7 | K | N/A | Aldrich Chemical Company Inc., 1990 | |
Tboil | 367. to 368. | K | N/A | PCR Inc., 1990 |

Reaction thermochemistry data

Data compiled as indicated in comments:
B - John E. Bartmess
RCD - Robert C. Dunbar
Individual Reactions
C6H2F3- + =
By formula: C6H2F3- + H+ = C6H3F3
Quantity | Value | Units | Method | Reference | Comment |
---|---|---|---|---|---|
ΔrH° | 1571. ± 8.8 | kJ/mol | G+TS | Buker, Nibbering, et al., 1997 | gas phase; B |
Quantity | Value | Units | Method | Reference | Comment |
ΔrG° | 1537. ± 8.4 | kJ/mol | IMRE | Buker, Nibbering, et al., 1997 | gas phase; B |
By formula: Cr+ + C6H3F3 = (Cr+ • C6H3F3)
Quantity | Value | Units | Method | Reference | Comment |
---|---|---|---|---|---|
ΔrH° | 123. | kJ/mol | RAK | Ryzhov, 1999 | RCD |

Gas phase ion energetics data

Data evaluated as indicated in comments:
HL - Edward P. Hunter and Sharon G. Lias
Data compiled as indicated in comments:
B - John E. Bartmess
LLK - Sharon G. Lias, Rhoda D. Levin, and Sherif A. Kafafi
Quantity | Value | Units | Method | Reference | Comment |
---|---|---|---|---|---|
Proton affinity (review) | 724.3 | kJ/mol | N/A | Hunter and Lias, 1998 | HL |
Quantity | Value | Units | Method | Reference | Comment |
Gas basicity | 696.6 | kJ/mol | N/A | Hunter and Lias, 1998 | HL |
Ionization energy determinations
IE (eV) | Method | Reference | Comment |
---|---|---|---|
9.4 | PE | Maier and Thommen, 1981 | LLK |
9.7 | PE | Bieri, Asbrink, et al., 1981 | LLK |
De-protonation reactions
C6H2F3- + =
By formula: C6H2F3- + H+ = C6H3F3
Quantity | Value | Units | Method | Reference | Comment |
---|---|---|---|---|---|
ΔrH° | 1571. ± 8.8 | kJ/mol | G+TS | Buker, Nibbering, et al., 1997 | gas phase; B |
Quantity | Value | Units | Method | Reference | Comment |
ΔrG° | 1537. ± 8.4 | kJ/mol | IMRE | Buker, Nibbering, et al., 1997 | gas phase; B |

Ion clustering data

Data compiled by: Robert C. Dunbar
Clustering reactions
By formula: Cr+ + C6H3F3 = (Cr+ • C6H3F3)
Quantity | Value | Units | Method | Reference | Comment |
---|---|---|---|---|---|
ΔrH° | 123. | kJ/mol | RAK | Ryzhov, 1999 |

References

Aldrich Chemical Company Inc., 1990
Aldrich Chemical Company Inc.,
Catalog Handbook of Fine Chemicals, Aldrich Chemical Company, Inc., Milwaukee WI, 1990, 1. [all data]
PCR Inc., 1990
PCR Inc.,
Research Chemicals Catalog 1990-1991, PCR Inc., Gainesville, FL, 1990, 1. [all data]
Buker, Nibbering, et al., 1997
Buker, H.H.; Nibbering, N.M.M.; Espinosa, D.; Mongin, F.; Schlosser, M.,
Additivity of substituent effects in the fluoroarene series: Equilibrium acidity in the gas phase and deprotonation rates in ethereal solution,
Tetrahed. Lett., 1997, 38, 49, 8519-8522, https://doi.org/10.1016/S0040-4039(97)10303-3
. [all data]
Ryzhov, 1999
Ryzhov, V.,
Binding Energies of Chromium Cations with Fluorobenzenes from Radiative Association Kinetics,
Int. J. Mass Spectrom., 1999, 185/186/187, 913. [all data]
Hunter and Lias, 1998
Hunter, E.P.; Lias, S.G.,
Evaluated Gas Phase Basicities and Proton Affinities of Molecules: An Update,
J. Phys. Chem. Ref. Data, 1998, 27, 3, 413-656, https://doi.org/10.1063/1.556018
. [all data]
Maier and Thommen, 1981
Maier, J.P.; Thommen, F.,
Fluorescence quantum yields and lifetimes of fluorobenzene cations in selected levels of their B and C states determined by photoelectron-photoion coincidence spectroscopy,
Chem. Phys., 1981, 57, 319. [all data]
Bieri, Asbrink, et al., 1981
Bieri, G.; Asbrink, L.; Von Niessen, W.,
30.4 nm He(II) photoelectron spectra of organic molecules. Part IV. Fluoro-compounds (C,H,F),
J. Electron Spectrosc. Relat. Phenom., 1981, 23, 281. [all data]