Difluoroborane, pentafluoroethyl-
- Formula: BF7Si2
- Molecular weight: 199.971
- IUPAC Standard InChIKey: JNJRONPBDVTCMC-UHFFFAOYSA-N
- CAS Registry Number: 14890-36-9
- Chemical structure:
View 3d structure (requires JavaScript / HTML 5) - Permanent link for this species. Use this link for bookmarking this species for future reference.

Gas phase ion energetics data

Data compiled by: Henry M. Rosenstock, Keith Draxl, Bruce W. Steiner, and John T. Herron
Appearance energy determinations
Ion | AE (eV) | Other Products | Method | Reference | Comment |
---|---|---|---|---|---|
BF2+ | 14.7 ± 0.1 | ? | EI | McDonald, Williams, et al., 1968 | |
SiBF4+ | 12.0 ± 0.1 | ? | EI | McDonald, Williams, et al., 1968 | |
Si2BF6+ | 15.4 ± 0.1 | F | EI | McDonald, Williams, et al., 1968 | |
SiF+ | 11.6 ± 0.1 | ? | EI | McDonald, Williams, et al., 1968 | |
SiF2+ | 13.2 ± 0.1 | ? | EI | McDonald, Williams, et al., 1968 | |
SiF3+ | 15.4 ± 0.1 | ? | EI | McDonald, Williams, et al., 1968 | |
Si2F4+ | 11.3 ± 0.1 | ? | EI | McDonald, Williams, et al., 1968 | |
Si2F5+ | 13.0 ± 0.1 | ? | EI | McDonald, Williams, et al., 1968 |

References

McDonald, Williams, et al., 1968
McDonald, J.D.; Williams, C.H.; Thompson, J.C.; Margrave, J.L.,
Appearance potentials, ionization potentials and heats of formation for perfluorosilanes and perfluoroborosilanes,
Advan. Chem. Ser., 1968, 72, 261. [all data]