Manganese, pentacarbonyliodo-
- Formula: C5IMnO5
- Molecular weight: 321.8930
- IUPAC Standard InChIKey: IGYXZZLAUYRNTO-UHFFFAOYSA-M
- CAS Registry Number: 14879-42-6
- Chemical structure:
View 3d structure (requires JavaScript / HTML 5) - Other names: Manganese pentacarbonyl iodide; Manganese, pentacarbonyliodo-, (OC-6-22)-; Iodine manganese pentacarbonyl; Iodomanganese pentacarbonyl; Pentacarbonyliodomanganese; Mn(CO)5I

Gas phase thermochemistry data

Data compiled by: José A. Martinho Simões
Quantity | Value | Units | Method | Reference | Comment |
---|---|---|---|---|---|
ΔfH°gas | -834.2 ± 5.2 | kJ/mol | Review | Martinho Simões |

Condensed phase thermochemistry data

Data compiled by: José A. Martinho Simões
Quantity | Value | Units | Method | Reference | Comment |
---|---|---|---|---|---|
ΔfH°solid | -911.6 ± 5.0 | kJ/mol | Review | Martinho Simões |

Phase change data

Data compiled as indicated in comments:
MS - José A. Martinho Simões
AC - William E. Acree, Jr., James S. Chickos
Quantity | Value | Units | Method | Reference | Comment |
---|---|---|---|---|---|
ΔsubH° | 77.4 ± 1.4 | kJ/mol | HAL-HFC | Connor, Zafarani-Moattar, et al., 1982 | MS |
ΔsubH° | 77.4 ± 1.4 | kJ/mol | C | Connor, Zafarani-Moattar, et al., 1982, 2 | AC |

Reaction thermochemistry data

Data compiled by: José A. Martinho Simões
Individual Reactions
By formula: C10Mn2O10 (cr) + I2 (cr) = 2C5IMnO5 (cr)
Quantity | Value | Units | Method | Reference | Comment |
---|---|---|---|---|---|
ΔrH° | -185.0 ± 8.7 | kJ/mol | PC | Harel and Adamson, 1986 | The reaction enthalpy was calculated from the enthalpy of the same reaction in cyclohexane, -187.9 ± 8.4 kJ/mol Harel and Adamson, 1986, and from the solution enthalpies of Mn2(CO)10(cr), 36.0 ± 2.1 kJ/mol, I2(cr), 20.5 ± 0.4 kJ/mol, and Mn(CO)5(I)(cr), 26.8 ± 0.5 kJ/mol Harel and Adamson, 1986. The latter value refers to the solution in benzene and is therefore taken as an approximation |
By formula: C5HMnO5 (l) + I2 (cr) = HI (g) + C5IMnO5 (cr)
Quantity | Value | Units | Method | Reference | Comment |
---|---|---|---|---|---|
ΔrH° | -108. ± 8. | kJ/mol | RSC | Connor, Zafarani-Moattar, et al., 1982 | The reaction enthalpy relies on -25. ± 5. kJ/mol for the enthalpy of solution of HI(g) in benzene Connor, Zafarani-Moattar, et al., 1982. |
C10MnO10Re (solution) + (solution) =
(solution) +
(solution)
By formula: C10MnO10Re (solution) + I2 (solution) = C5IO5Re (solution) + C5IMnO5 (solution)
Quantity | Value | Units | Method | Reference | Comment |
---|---|---|---|---|---|
ΔrH° | -233. ± 13. | kJ/mol | PC | Harel and Adamson, 1986 | solvent: Cyclohexane |
(solution) +
(solution) = 2
(solution)
By formula: C10Mn2O10 (solution) + I2 (solution) = 2C5IMnO5 (solution)
Quantity | Value | Units | Method | Reference | Comment |
---|---|---|---|---|---|
ΔrH° | -187.9 ± 8.4 | kJ/mol | PC | Harel and Adamson, 1986 | solvent: Cyclohexane |

Gas phase ion energetics data

Data compiled as indicated in comments:
LLK - Sharon G. Lias, Rhoda D. Levin, and Sherif A. Kafafi
RDSH - Henry M. Rosenstock, Keith Draxl, Bruce W. Steiner, and John T. Herron
Ionization energy determinations
IE (eV) | Method | Reference | Comment |
---|---|---|---|
8.55 ± 0.02 | EI | Junk, Svec, et al., 1968 | RDSH |
8.40 ± 0.05 | PE | Higginson, Lloyd, et al., 1975 | Vertical value; LLK |
8.44 | PE | Lichtenberger, Sarapu, et al., 1973 | Vertical value; LLK |
8.35 | PE | Evans, Green, et al., 1969 | Vertical value; RDSH |
Appearance energy determinations
Ion | AE (eV) | Other Products | Method | Reference | Comment |
---|---|---|---|---|---|
COIMn+ | 12.37 | 4CO | EI | Junk, Svec, et al., 1968 | RDSH |
MnCO+ | 14.4 | ? | EI | Junk, Svec, et al., 1968 | RDSH |
C2O2IMn+ | 10.46 | 3CO | EI | Junk, Svec, et al., 1968 | RDSH |
C3O3IMn+ | 9.49 | 2CO | EI | Junk, Svec, et al., 1968 | RDSH |
MnC3O3+ | 12.13 | ? | EI | Junk, Svec, et al., 1968 | RDSH |
MnI+ | 14.0 | 5CO | EI | Junk, Svec, et al., 1968 | RDSH |
Mn+ | 16.2 | ? | EI | Junk, Svec, et al., 1968 | RDSH |

References

Martinho Simões
Martinho Simões, J.A.,
Private communication (see http://webbook.nist.gov/chemistry/om/). [all data]
Connor, Zafarani-Moattar, et al., 1982
Connor, J.A.; Zafarani-Moattar, M.T.; Bickerton, J.; El-Saied, N.I.; Suradi, S.; Carson, R.; Al Takkhin, G.; Skinner, H.A.,
Organomet., 1982, 1, 1166. [all data]
Connor, Zafarani-Moattar, et al., 1982, 2
Connor, Joseph A.; Zafarani-Moattar, Mohamed T.; Bickerton, James; El Saied, Nabila I.; Suradi, Sukiman; Carson, Ronald; Al Takhin, Ghassan; Skinner, Henry A.,
Enthalpy of formation of acyl-, alkyl- and hydridopentacarbonyl-manganese complexes. The enthalpy contributions of manganese-hydrogen and manganese-carbon bonds in these molecules. Thermochemical aspects of models in Fischer-Tropsch reactions,
Organometallics, 1982, 1, 9, 1166-1174, https://doi.org/10.1021/om00069a011
. [all data]
Harel and Adamson, 1986
Harel, Y.; Adamson, A.W.,
J. Phys. Chem., 1986, 90, 6693. [all data]
Junk, Svec, et al., 1968
Junk, G.A.; Svec, H.J.; Angelici, R.J.,
Electron impact studies of manganese and rhenium pentacarbonyl halides,
J. Am. Chem. Soc., 1968, 90, 5758. [all data]
Higginson, Lloyd, et al., 1975
Higginson, B.R.; Lloyd, D.R.; Evans, S.; Orchard, A.F.,
Photoelectron studies of metal carbonyls. Part 5. - Substituted group VIIA carbonyls,
J. Chem. Soc. Faraday Trans. 2, 1975, 71, 1913. [all data]
Lichtenberger, Sarapu, et al., 1973
Lichtenberger, D.L.; Sarapu, A.C.; Fenske, R.F.,
Photoelectron spectra and electronic structure of pentacarbonylmanganese halides,
Inorg. Chem., 1973, 12, 702. [all data]
Evans, Green, et al., 1969
Evans, S.; Green, J.C.; Green, M.L.H.; Orchard, A.F.; Turner, D.W.,
Study of the bonding in pentacarbonylmanganese derivatives by photoelectron spectroscopy,
Faraday Discuss. Chem. Soc., 1969, 47, 112. [all data]