BF4-
- Formula: BF4-
- Molecular weight: 86.805
- IUPAC Standard InChIKey: ODGCEQLVLXJUCC-UHFFFAOYSA-N
- CAS Registry Number: 14874-70-5
- Chemical structure:
View 3d structure (requires JavaScript / HTML 5) - Species with the same structure:

Vibrational and/or electronic energy levels

Data compiled by: Marilyn E. Jacox
State: X
Vib. sym. |
No. | Approximate type of mode |
cm-1 | Med. | Method | References | |
---|---|---|---|---|---|---|---|
BF stretch | 1197 | vs Cs | Ar | IR | Hunt and Ault, 1981 | ||
BF stretch | 1014 | Cs | Ar | IR | Hunt and Ault, 1981 | ||
Deformation | 524 | Cs | Ar | IR | Hunt and Ault, 1981 | ||
Additional references: Jacox, 1994, page 302

References

Hunt and Ault, 1981
Hunt, R.L.; Ault, B.S.,
Spectrochim. Acta, 1981, 37A, 63. [all data]
Jacox, 1994
Jacox, M.E.,
Vibrational and electronic energy levels of polyatomic transient molecules, American Chemical Society, Washington, DC, 1994, 464. [all data]