Pentasilane
- Formula: H12Si5
- Molecular weight: 152.5228
- IUPAC Standard InChIKey: LUXIMSHPDKSEDK-UHFFFAOYSA-N
- CAS Registry Number: 14868-53-2
- Chemical structure:
View 3d structure (requires JavaScript / HTML 5) - Permanent link for this species. Use this link for bookmarking this species for future reference.

Gas phase ion energetics data

Data compiled by: Sharon G. Lias, Rhoda D. Levin, and Sherif A. Kafafi
Ionization energy determinations
IE (eV) | Method | Reference | Comment |
---|---|---|---|
9.36 | PE | Bock, Ensslin, et al., 1976 | Vertical value |

References

Bock, Ensslin, et al., 1976
Bock, H.; Ensslin, W.; Feher, F.; Freund, R.,
Photoelectron spectra and molecular properties. LI. Ionization potentials of silanes SinH2n+2,
J. Am. Chem. Soc., 1976, 98, 668. [all data]