Spiro[4.4]nona-1,3,6,8-tetraene
- Formula: C9H8
- Molecular weight: 116.1598
- IUPAC Standard InChIKey: CLZMRBFGNUYTSN-UHFFFAOYSA-N
- CAS Registry Number: 14867-83-5
- Chemical structure:
View 3d structure (requires JavaScript / HTML 5) - Permanent link for this species. Use this link for bookmarking this species for future reference.

Gas phase ion energetics data

Data compiled as indicated in comments:
LLK - Sharon G. Lias, Rhoda D. Levin, and Sherif A. Kafafi
Ionization energy determinations
IE (eV) | Method | Reference | Comment |
---|---|---|---|
7.99 | PE | Batich, Heilbronner, et al., 1974 | Vertical value; LLK |
7.99 | PE | Batich, Heilbronner, et al., 1973 | Vertical value; LLK |

References

Batich, Heilbronner, et al., 1974
Batich, C.; Heilbronner, E.; Rommel, E.; Semmelhack, M.F.; Foos, J.S.,
Equivalence of the energy gaps {DELTA}I(1,2) and {DELTA}E(1,2) between corresponding bands in the photoelectron (I) and electronic absorption (E) spectra of spiro[4.4]nonatetraene. An amusing consequence of spiroconjugation,
J. Am. Chem. Soc., 1974, 96, 7662. [all data]
Batich, Heilbronner, et al., 1973
Batich, C.; Heilbronner, E.; Semmelhack, M.F.,
225. Bemerkung zur Gleichheit der Aufspaltungen δI (zwischen den ersten beiden π-Ionisationspotentialen) und δ (zwischen den entsprechenden π* π Ubergangsenergien) des Spiro[4,4]nonatetraens,
Helv. Chim. Acta, 1973, 56, 2110. [all data]