Cyclododecene, (E)-
- Formula: C12H22
- Molecular weight: 166.3031
- IUPAC Standard InChIKey: HYPABJGVBDSCIT-OWOJBTEDSA-N
- CAS Registry Number: 1486-75-5
- Chemical structure:
View 3d structure (requires JavaScript / HTML 5) - Stereoisomers:
- Other names: (E)-Cyclododecene; trans-Cyclododecene; Cyclododecene, trans-; t-Cyclododecene

Reaction thermochemistry data

Data compiled by: Hussein Y. Afeefy, Joel F. Liebman, and Stephen E. Stein
Individual Reactions
By formula: H2 + C12H22 = C12H24
Quantity | Value | Units | Method | Reference | Comment |
---|---|---|---|---|---|
ΔrH° | -112. | kJ/mol | Chyd | Sicher, Svoboda, et al., 1968 | liquid phase; solvent: Acetic acid |

Gas phase ion energetics data

Data compiled as indicated in comments:
LLK - Sharon G. Lias, Rhoda D. Levin, and Sherif A. Kafafi
Ionization energy determinations
IE (eV) | Method | Reference | Comment |
---|---|---|---|
8.74 ± 0.15 | EI | Remane, Graefe, et al., 1972 | LLK |

Kovats' RI, non-polar column, isothermal

Column type | Active phase | Temperature (C) | I | Reference | Comment |
---|---|---|---|---|---|
Capillary | OV-1 | 150. | 1336.7 | Rudenko and Rudenko, 2005 | He; Column diameter: 0.25 mm |
Capillary | OV-1 | 170. | 1342. | Rudenko and Rudenko, 2005 | He; Column diameter: 0.25 mm |
Capillary | OV-1 | 190. | 1356. | Rudenko and Rudenko, 2005 | He; Column diameter: 0.25 mm |
Capillary | OV-1 | 150. | 1336.7 | Rudenko and Rudenko, 2000 | He; Column diameter: 0.25 mm |
Capillary | OV-1 | 170. | 1342. | Rudenko and Rudenko, 2000 | He; Column diameter: 0.25 mm |
Capillary | OV-1 | 190. | 1356. | Rudenko and Rudenko, 2000 | He; Column diameter: 0.25 mm |
Capillary | Methyl Silicone | 160. | 1344. | Boneva and Balbolov, 1993 | 50. m/0.25 mm/1.0 μm, N2 |
Capillary | Methyl Silicone | 170. | 1354. | Boneva and Balbolov, 1993 | 50. m/0.25 mm/1.0 μm, N2 |
Capillary | Methyl Silicone | 180. | 1362. | Boneva and Balbolov, 1993 | 50. m/0.25 mm/1.0 μm, N2 |
Capillary | OV-1 | 100. | 1291.5 | Engewald, Billing, et al., 1987 | Column length: 50. m; Column diameter: 0.3 mm |
Packed | Squalane | 120. | 1306. | Bogoslovsky, Anvaer, et al., 1978 | |
Capillary | Squalane | 120. | 1306. | Engewald, Epsch, et al., 1974 | N2; Column length: 100. m; Column diameter: 0.23 mm |
Capillary | Squalane | 120. | 1306. | Schomburg, 1967 | Ar; Column length: 100. m |
Capillary | Squalane | 120. | 1306. | Schomburg, 1966 | |
Capillary | Squalane | 120. | 1306. | Schomburg, 1966 |

Kovats' RI, polar column, isothermal

Column type | Active phase | Temperature (C) | I | Reference | Comment |
---|---|---|---|---|---|
Capillary | Carbowax 40M | 150. | 1539.8 | Rudenko and Rudenko, 2000 | He; Column diameter: 0.25 mm |
Capillary | Carbowax 40M | 170. | 1557.9 | Rudenko and Rudenko, 2000 | He; Column diameter: 0.25 mm |
Capillary | Carbowax 40M | 190. | 1577.9 | Rudenko and Rudenko, 2000 | He; Column diameter: 0.25 mm |

References

Sicher, Svoboda, et al., 1968
Sicher, J.; Svoboda, M.; Mallon, B.J.; Turner, R.B.,
Stereochemical studies. Part XLVII. Conformational analysis of many-membered ring compounds. The cyclododecenes,
J. Chem. Soc. B, 1968, 441-447. [all data]
Remane, Graefe, et al., 1972
Remane, H.; Graefe, J.; Herzschuh, R.,
Ionisationspotentiale von cis- und trans-Cycloalkenen,
Z. Chem., 1972, 12, 194. [all data]
Rudenko and Rudenko, 2005
Rudenko, B.A.; Rudenko, G.I.,
Gas chromatography with open tubular columns of cyclododecane derivatives,
J. Anal. Chem. USSR (Engl. Transl.), 2005, 60, 4, 345-348. [all data]
Rudenko and Rudenko, 2000
Rudenko, B.A.; Rudenko, G.I.,
Capillary chromatography of cyclododecane derivatives, Proceedings, 23rd ISCC; CD-ROM, 2000, retrieved from http://www.richrom.com/assets/CD23PDF. [all data]
Boneva and Balbolov, 1993
Boneva, S.; Balbolov, E.,
Capillary gas chromatography of hydrogenation products of 1,5,9-cyclododecatriene stereoisomers,
Chromatographia, 1993, 37, 5/6, 277-280, https://doi.org/10.1007/BF02278633
. [all data]
Engewald, Billing, et al., 1987
Engewald, W.; Billing, U.; Welsch, T.; Haufe, G.,
Structure-retention correlations of hydrocarbons in gas-liquid and gas-solid chromatography. Cycloalkenes and cycloalkadienes,
Chromatographia, 1987, 23, 8, 590-594, https://doi.org/10.1007/BF02324870
. [all data]
Bogoslovsky, Anvaer, et al., 1978
Bogoslovsky, Yu.N.; Anvaer, B.I.; Vigdergauz, M.S.,
Chromatographic constants in gas chromatography (in Russian), Standards Publ. House, Moscow, 1978, 192. [all data]
Engewald, Epsch, et al., 1974
Engewald, W.; Epsch, K.; Graefe, J.; Welsch, Th.,
Molekülstruktur und retentionsverhalten. II. Retentionsverhalten cycloaliphatischer kohlenwasser-stoffe bei der gas-adsorptions- und gas-verteilungschromatographie,
J. Chromatogr., 1974, 91, 623-631, https://doi.org/10.1016/S0021-9673(01)97943-9
. [all data]
Schomburg, 1967
Schomburg, G.,
Struktur und Retentionsverhalten von Offenkettigen und Cyclischen Kohlenwasserstoffen und Deren Einfacher Substitutionsprodukte,
Anal. Chim. Acta., 1967, 38, 45-64, https://doi.org/10.1016/S0003-2670(01)80560-2
. [all data]
Schomburg, 1966
Schomburg, G.,
Gaschromatographische Retentionsdaten und struktur chemischer verbindungen. III. Alkylverzweigte und ungesättigte cyclische Kohlenwasserstoffe,
J. Chromatogr., 1966, 23, 18-41, https://doi.org/10.1016/S0021-9673(01)98653-4
. [all data]