Phosphine, methyldiphenyl-

Gas phase ion energetics data

Data evaluated as indicated in comments:
HL - Edward P. Hunter and Sharon G. Lias

Data compiled as indicated in comments:
LBLHLM - Sharon G. Lias, John E. Bartmess, Joel F. Liebman, John L. Holmes, Rhoda D. Levin, and W. Gary Mallard

Quantity Value Units Method Reference Comment
Proton affinity (review)232.3kcal/molN/AHunter and Lias, 1998HL
Quantity Value Units Method Reference Comment
Gas basicity224.6kcal/molN/AHunter and Lias, 1998HL

Ionization energy determinations

IE (eV) Method Reference Comment
8.28 ± 0.05PEIkuta, Kebarle, et al., 1982Vertical value; LBLHLM

References

Hunter and Lias, 1998
Hunter, E.P.; Lias, S.G., Evaluated Gas Phase Basicities and Proton Affinities of Molecules: An Update, J. Phys. Chem. Ref. Data, 1998, 27, 3, 413-656, https://doi.org/10.1063/1.556018 . [all data]

Ikuta, Kebarle, et al., 1982
Ikuta, S.; Kebarle, P.; Bancroft, G.M.; Chan, T.; Puddephatt, R.J., Basicities of methyl-, methylphenyl-, and phenylphosphines in the gas phase, J. Am. Chem. Soc., 1982, 104, 5899. [all data]