3-Benzyloxyaniline
- Formula: C13H13NO
- Molecular weight: 199.2484
- IUPAC Standard InChIKey: IGPFOKFDBICQMC-UHFFFAOYSA-N
- CAS Registry Number: 1484-26-0
- Chemical structure:
View 3d structure (requires JavaScript / HTML 5) - Other names: Benzenamine, 3-(phenylmethoxy)-; 3-Aminophenyl benzyl ether

Gas phase ion energetics data

Data compiled by: Henry M. Rosenstock, Keith Draxl, Bruce W. Steiner, and John T. Herron
Ionization energy determinations
IE (eV) | Method | Reference |
---|---|---|
8.0 | EI | Ward, Cooks, et al., 1969 |
Appearance energy determinations
Ion | AE (eV) | Other Products | Method | Reference | Comment |
---|---|---|---|---|---|
C6H6NO+ | 10.1 | ? | EI | Ward, Cooks, et al., 1969 | |
C7H7+ | 9.9 | ? | EI | Ward, Cooks, et al., 1969 |

References

Ward, Cooks, et al., 1969
Ward, R.S.; Cooks, R.d.; Williams, D.H.,
Substituent effects in mass spectrometry. Mass spectra of substituted phenyl benzyl ethers,
J. Am. Chem. Soc., 1969, 91, 2727. [all data]