9H-Carbazole, 9-(1-methylethyl)-
- Formula: C15H15N
- Molecular weight: 209.2863
- IUPAC Standard InChIKey: LSZJZNNASZFXKN-UHFFFAOYSA-N
- CAS Registry Number: 1484-09-9
- Chemical structure:
View 3d structure (requires JavaScript / HTML 5) - Other names: Carbazole, 9-isopropyl-; N-Isopropylcarbazole; 9-Isopropyl carbazole; 9H-Carbazole, 9-isopropyl-; 9-isopropyl-9H-carbazole

Phase change data

Data compiled as indicated in comments:
TRC - Thermodynamics Research Center, NIST Boulder Laboratories, Chris Muzny director
AC - William E. Acree, Jr., James S. Chickos
Quantity | Value | Units | Method | Reference | Comment |
---|---|---|---|---|---|
Tfus | 395.2 | K | N/A | Krajewska, 1990 | Uncertainty assigned by TRC = 0.3 K; by DSC; TRC |
Tfus | 396.15 | K | N/A | Klopffer, 1969 | Uncertainty assigned by TRC = 1. K; TRC |
Tfus | 395.15 | K | N/A | Sharp, 1967 | Uncertainty assigned by TRC = 1. K; TRC |
Tfus | 393.4 | K | N/A | Lopatinskii, Sirotkina, et al., 1964 | Uncertainty assigned by TRC = 4. K; TRC |
Enthalpy of fusion
ΔfusH (kcal/mol) | Temperature (K) | Method | Reference | Comment |
---|---|---|---|---|
4.238 | 395.2 | DSC | Acree, 1991 | See also Kalinowski, Dreger, et al., 1990.; AC |

Gas phase ion energetics data

Data compiled by: Henry M. Rosenstock, Keith Draxl, Bruce W. Steiner, and John T. Herron
Ionization energy determinations
IE (eV) | Method | Reference |
---|---|---|
7.4 | CTS | Klopffer, 1969, 2 |
7.80 | CTS | Sharp, 1966 |

References

Krajewska, 1990
Krajewska, A.,
Phase diagrams in the binary systems of N-isopropylcarbazole with 2,4,7-trinitrofluoren-9-one and carbazole,
Thermochim. Acta, 1990, 158, 317. [all data]
Klopffer, 1969
Klopffer, W.,
Transfer of Electronic Excitation Energy in Solid Solutions of Perylene in N-Isopropylcarbazole,
J. Chem. Phys., 1969, 50, 1689. [all data]
Sharp, 1967
Sharp, J.H.,
Photoconductivity of N-Isopropylcarbazole and Its Picryl Chloride Complex,
J. Phys. Chem., 1967, 71, 2587. [all data]
Lopatinskii, Sirotkina, et al., 1964
Lopatinskii, V.P.; Sirotkina, E.E.; Sukhoroslava, M.M.,
N-Alkylcarbazoles,
Metody Poluch. Khim. Reak. Prep., 1964, 1964, No. 11, 69-72. [all data]
Acree, 1991
Acree, William E.,
Thermodynamic properties of organic compounds: enthalpy of fusion and melting point temperature compilation,
Thermochimica Acta, 1991, 189, 1, 37-56, https://doi.org/10.1016/0040-6031(91)87098-H
. [all data]
Kalinowski, Dreger, et al., 1990
Kalinowski, J.; Dreger, Z.; Godlewski, J.; Mondalski, P.,
Structural transformations in N-isopropylcarbazole crystal monitored by pressure-induced luminescence,
Chemical Physics Letters, 1990, 172, 6, 522-528, https://doi.org/10.1016/0009-2614(90)80150-C
. [all data]
Klopffer, 1969, 2
Klopffer, W.,
Uber die elektronischen Energieniveaus des N-Isopropylcarbazols und seiner Radikalionen. I. Teil: Ionisierungsenergie. Elektronenaffinitat und Radikalionenspektren,
Z. Naturforsch., 1969, 24a, 1923. [all data]
Sharp, 1966
Sharp, J.H.,
Charge-transfer complexes of N-isopropylcarbazole,
J. Phys. Chem., 1966, 70, 584. [all data]