Benzene,(chloroethynyl)-
- Formula: C8H5Cl
- Molecular weight: 136.578
- IUPAC Standard InChIKey: GDWZLADUGAKASM-UHFFFAOYSA-N
- CAS Registry Number: 1483-82-5
- Chemical structure:
View 3d structure (requires JavaScript / HTML 5) - Other names: 2-Chloro-1-phenylacetylene

Gas phase ion energetics data

Data compiled by: Sharon G. Lias, Rhoda D. Levin, and Sherif A. Kafafi
Ionization energy determinations
IE (eV) | Method | Reference | Comment |
---|---|---|---|
8.70 | PE | Griebel, Hohlneicher, et al., 1974 | Vertical value |

References

Griebel, Hohlneicher, et al., 1974
Griebel, R.; Hohlneicher, G.; Dorr, F.,
A photoelectron spectroscopic study of benzonitrile, ethynylbenzene and some of its substituted derivatives,
J. Electron Spectrosc. Relat. Phenom., 1974, 4, 185. [all data]
Miller, 1973
Miller, Lii ahd S.I.,
J. Am. Chem. Soc., 1973, 95, 1602. [all data]