1,3,5,7-Octatetraene
- Formula: C8H10
- Molecular weight: 106.1650
- IUPAC Standard InChIKey: VXQUABLSXKFKLO-KQQUZDAGSA-N
- CAS Registry Number: 1482-91-3
- Chemical structure:
View 3d structure (requires JavaScript / HTML 5) - Species with the same structure:
- Stereoisomers:

Gas phase ion energetics data

Data compiled by: Henry M. Rosenstock, Keith Draxl, Bruce W. Steiner, and John T. Herron
Ionization energy determinations
IE (eV) | Method | Reference |
---|---|---|
~7.8 | DER | Price, 1946 |

References

Price, 1946
Price, W.C.,
The absorption spectra of hexatriene and divinyl acetylene in the vacuum ultraviolet,
Proc. Roy. Soc. (London) Al, 1946, 85, 182. [all data]