Benzoic acid, 2-mercapto-
- Formula: C7H6O2S
- Molecular weight: 154.186
- IUPAC Standard InChIKey: NBOMNTLFRHMDEZ-UHFFFAOYSA-N
- CAS Registry Number: 147-93-3
- Chemical structure:
View 3d structure (requires JavaScript / HTML 5) - Other names: Benzoic acid, o-mercapto-; o-Benzoic acid thiol; o-Mercaptobenzoic acid; o-Sulfhydrylbenzoic acid; o-Thiosalicylic acid; Salicylic acid, 2-thio-; 2-Carboxythiophenol; 2-Mercaptobenzoic acid; Thiosalicylic acid; o-Mercaptobenzoesaeure; USAF EK-T-2805; USAF KF-2; USAF XR-35; o-Carboxythiophenol; Thiophenol-2-carboxylic acid; 2-Thiosalicylic acid; NSC 2184; NSC 660640; 2-Sulfanylbenzoic acid; 860499-02-1

Reaction thermochemistry data

Data compiled by: Hussein Y. Afeefy, Joel F. Liebman, and Stephen E. Stein
Individual Reactions
By formula: C9H8O3S + H2O = C7H6O2S + C2H4O2
Quantity | Value | Units | Method | Reference | Comment |
---|---|---|---|---|---|
ΔrH° | -24.5 ± 0.3 | kJ/mol | Cm | Nelander, 1964 | solid phase; Heat of hydrolysis |

Van Den Dool and Kratz RI, non-polar column, temperature ramp

Column type | Active phase | I | Reference | Comment |
---|---|---|---|---|
Capillary | VF-5MS | 1497. | Todua, 2011 | 30. m/0.25 mm/0.25 μm, He; Tstart: 60. C; Tend: 270. C |

Normal alkane RI, non-polar column, custom temperature program

Column type | Active phase | I | Reference | Comment |
---|---|---|---|---|
Other | Methyl Silicone | 1494. | Ardrey and Moffat, 1981 | Program: not specified |

References

Nelander, 1964
Nelander, L.,
The heats of hydrolysis of aspirin, thioaspirin, and their p-analogues,
Acta Chem. Scand., 1964, 18, 973-984. [all data]
Todua, 2011
Todua, N.G.,
Retention Data. NIST Mass Spectrometry Data Center., NIST Mass Spectrometry Data Center, 2011. [all data]
Ardrey and Moffat, 1981
Ardrey, R.E.; Moffat, A.C.,
Gas-liquid chromatographic retention indices of 1318 substances of toxicological interest on SE-30 or OV-1 stationary phase,
J. Chromatogr., 1981, 220, 3, 195-252, https://doi.org/10.1016/S0021-9673(00)81925-1
. [all data]