Proline
- Formula: C5H9NO2
- Molecular weight: 115.1305
- IUPAC Standard InChIKey: ONIBWKKTOPOVIA-SCSAIBSYSA-N
- CAS Registry Number: 147-85-3
- Chemical structure:
View 3d structure (requires JavaScript / HTML 5) - Stereoisomers:
- Other names: L-Proline; Proline, L-; (-)-(S)-Proline; L-(-)-Proline; 2-Pyrrolidinecarboxylic acid; 2-Pyrrolidinecarboxylic acid, (S)-

Gas phase thermochemistry data

Data compiled by: Hussein Y. Afeefy, Joel F. Liebman, and Stephen E. Stein
Quantity | Value | Units | Method | Reference | Comment |
---|---|---|---|---|---|
ΔfH°gas | -366.2 ± 4.0 | kJ/mol | Ccb | Sabbah and Laffitte, 1978 | see Sabbath and Laffitte, 1978 |

Condensed phase thermochemistry data

Data compiled as indicated in comments:
ALS - Hussein Y. Afeefy, Joel F. Liebman, and Stephen E. Stein
DH - Eugene S. Domalski and Elizabeth D. Hearing
Quantity | Value | Units | Method | Reference | Comment |
---|---|---|---|---|---|
ΔfH°solid | -507.6 ± 2.6 | kJ/mol | Ccb | Vasilev, Borodin, et al., 1989 | Uc =-2744.77 kJ/mol; ALS |
ΔfH°solid | -515.18 ± 0.52 | kJ/mol | Ccb | Sabbath and Laffitte, 1978 | ALS |
Quantity | Value | Units | Method | Reference | Comment |
ΔcH°solid | -2746.2 ± 2.5 | kJ/mol | Ccb | Vasilev, Borodin, et al., 1989 | Uc =-2744.77 kJ/mol; ALS |
ΔcH°solid | -2738.6 ± 0.4 | kJ/mol | Ccb | Sabbath and Laffitte, 1978 | ALS |
Quantity | Value | Units | Method | Reference | Comment |
S°solid,1 bar | 164.06 | J/mol*K | N/A | Cole, Hutchens, et al., 1963 | DH |
S°solid,1 bar | 170.7 | J/mol*K | N/A | Huffman and Fox, 1940 | Extrapolation below 90 K, 56.07 J/mol*K.; DH |
Constant pressure heat capacity of solid
Cp,solid (J/mol*K) | Temperature (K) | Reference | Comment |
---|---|---|---|
150.4 | 298.15 | Spink and Wads, 1975 | DH |
151.17 | 298.15 | Cole, Hutchens, et al., 1963 | T = 11 to 305 K.; DH |
149.12 | 300.4 | Huffman and Fox, 1940 | T = 90 to 298 K. Value is unsmoothed experimental datum.; DH |

Phase change data

Data compiled as indicated in comments:
ALS - Hussein Y. Afeefy, Joel F. Liebman, and Stephen E. Stein
AC - William E. Acree, Jr., James S. Chickos
Quantity | Value | Units | Method | Reference | Comment |
---|---|---|---|---|---|
ΔsubH° | 149. ± 2. | kJ/mol | C | Sabbah and Laffitte, 1978 | see Sabbath and Laffitte, 1978; ALS |
Enthalpy of sublimation
ΔsubH (kJ/mol) | Temperature (K) | Method | Reference | Comment |
---|---|---|---|---|
127. ± 1. | 406. | TE,ME | de Kruif, Voogd, et al., 1979 | Based on data from 396. to 416. K.; AC |
149. ± 4. | 400. | C | Sabbah and Laffite, 1978 | Based on data from 380. to 420. K.; AC |
96.7 ± 0.8 | 455. | V | Svec and Clyde, 1965 | ALS |

Gas phase ion energetics data

Data evaluated as indicated in comments:
HL - Edward P. Hunter and Sharon G. Lias
Data compiled as indicated in comments:
B - John E. Bartmess
MM - Michael M. Meot-Ner (Mautner)
LBLHLM - Sharon G. Lias, John E. Bartmess, Joel F. Liebman, John L. Holmes, Rhoda D. Levin, and W. Gary Mallard
RDSH - Henry M. Rosenstock, Keith Draxl, Bruce W. Steiner, and John T. Herron
Quantity | Value | Units | Method | Reference | Comment |
---|---|---|---|---|---|
Proton affinity (review) | 920.5 | kJ/mol | N/A | Hunter and Lias, 1998 | HL |
Quantity | Value | Units | Method | Reference | Comment |
Gas basicity | 886.0 | kJ/mol | N/A | Hunter and Lias, 1998 | HL |
Proton affinity at 298K
Proton affinity (kJ/mol) | Reference | Comment |
---|---|---|
925.9 ± 1.6 | Bouchoux and Salpin, 2003 | T = 298K; MM |
936.0 | Mezzache, Afonso, et al., 2003 | T = T(eff) = 315K; MM |
920.1 | Mirza, Prabhakar, et al., 2001 | T = T(eff) = 559-809K; Amino acids used as reference compounds. T(eff) at collision energies of 20 - 60 eV are 559-809 K.; MM |
938.9 | Bojesen and Breindahl, 1994 | PA increased by 2.0 kcal/mol for referencing values to Hunter and Lias, 1998; MM |
Gas basicity at 298K
Gas basicity (review) (kJ/mol) | Reference | Comment |
---|---|---|
895.7 ± 1.6 | Bouchoux and Salpin, 2003 | T = 298K; MM |
Ionization energy determinations
IE (eV) | Method | Reference | Comment |
---|---|---|---|
8.3 | PE | Cannington and Ham, 1983 | LBLHLM |
9.36 | CTS | Slifkin and Allison, 1967 | RDSH |
9.0 | PE | Cannington and Ham, 1983 | Vertical value; LBLHLM |
De-protonation reactions
C5H8NO2- + =
By formula: C5H8NO2- + H+ = C5H9NO2
Quantity | Value | Units | Method | Reference | Comment |
---|---|---|---|---|---|
ΔrH° | 1423. ± 13. | kJ/mol | G+TS | O'Hair, Bowie, et al., 1992 | gas phase; B |
ΔrH° | 1431. ± 9.2 | kJ/mol | CIDC | Jones, Bernier, et al., 2007 | gas phase; B |
Quantity | Value | Units | Method | Reference | Comment |
ΔrG° | 1395. ± 13. | kJ/mol | CIDC | O'Hair, Bowie, et al., 1992 | gas phase; B |

Reaction thermochemistry data

Data compiled by: John E. Bartmess
Individual Reactions
C5H8NO2- + =
By formula: C5H8NO2- + H+ = C5H9NO2
Quantity | Value | Units | Method | Reference | Comment |
---|---|---|---|---|---|
ΔrH° | 340.2 ± 3.1 | kcal/mol | G+TS | O'Hair, Bowie, et al., 1992 | gas phase |
ΔrH° | 342.0 ± 2.2 | kcal/mol | CIDC | Jones, Bernier, et al., 2007 | gas phase |
Quantity | Value | Units | Method | Reference | Comment |
ΔrG° | 333.4 ± 3.0 | kcal/mol | CIDC | O'Hair, Bowie, et al., 1992 | gas phase |

References

Sabbah and Laffitte, 1978
Sabbah, R.; Laffitte, M.,
Thermodynamique de composes azotes. IV. Etude thermochimique de la sarcosine et de la L-proline,
Bull. Soc. Chim. Fr., 1978, 1, 50-52. [all data]
Sabbath and Laffitte, 1978
Sabbath, R.; Laffitte, M.,
Enthalpy of formation of solid L-proline,
J. Chem. Thermodyn., 1978, 10, 101-102. [all data]
Vasilev, Borodin, et al., 1989
Vasilev, V.P.; Borodin, V.A.; Kopnyshev, S.B.,
Standard enthalpies of formation of L-histidine and L-proline,
Russ. J. Phys. Chem. (Engl. Transl.), 1989, 63, 891-892. [all data]
Cole, Hutchens, et al., 1963
Cole, A.G.; Hutchens, J.O.; Stout, J.W.,
Heat capacities from 11 to 305°K. and entropies of L-phenylalanine, L-proline, L-tryptophane, and L-tyrosine. Some free energies of formation,
J. Phys. Chem., 1963, 67, 1852-1855. [all data]
Huffman and Fox, 1940
Huffman, H.M.; Fox, S.W.,
Thermal data. XIII. The heat capacities and entropies of creatine hydrate, DL-citrulline, DL-ornithine, L-proline and taurine,
J. Am. Chem. Soc., 1940, 62, 3464-3465. [all data]
Spink and Wads, 1975
Spink, C.H.; Wads, I.,
Thermochemistry of solutions of biochemical model compounds. 4. The partial molar heat capacities of some amino acids in aqueous solution,
J. Chem. Thermodynam., 1975, 7, 561-572. [all data]
de Kruif, Voogd, et al., 1979
de Kruif, C.G.; Voogd, J.; Offringa, J.C.A.,
Enthalpies of sublimation and vapour pressures of 14 amino acids and peptides,
The Journal of Chemical Thermodynamics, 1979, 11, 7, 651-656, https://doi.org/10.1016/0021-9614(79)90030-2
. [all data]
Sabbah and Laffite, 1978
Sabbah, R.; Laffite, M.,
Bull. Soc. Chim. Fr., 1978, 1, 50. [all data]
Svec and Clyde, 1965
Svec, H.J.; Clyde, D.D.,
Vapor pressures of some α-amino acids,
J. Chem. Eng. Data, 1965, 10, 151. [all data]
Hunter and Lias, 1998
Hunter, E.P.; Lias, S.G.,
Evaluated Gas Phase Basicities and Proton Affinities of Molecules: An Update,
J. Phys. Chem. Ref. Data, 1998, 27, 3, 413-656, https://doi.org/10.1063/1.556018
. [all data]
Bouchoux and Salpin, 2003
Bouchoux, G.; Salpin, J.Y.,
Gas-phase basicity of glycine, alanine, proline, serine, lysine, histidine and some of their peptides by the thermokinetic method,
European J. Mass Spectrometry, 2003, 9, 391-402. [all data]
Mezzache, Afonso, et al., 2003
Mezzache, S.; Afonso, C.; Pepe, C.; Karoyan, P.; Fournier, F.; Tabet, J.C.,
Proton Affinity of Proline and Modified Prolines Using the Kinetic Method: Role of the Conformation Investigated by ab intio Calculations,
Rapid Comm. Mass Spectrometry, 2003, 17, 1626. [all data]
Mirza, Prabhakar, et al., 2001
Mirza, S.P.; Prabhakar, S.; Vairamani, M.,
Estimation of proton affinity of proline and tryptophan under electrospray ionization conditions using the extended kinetic method,
Rapid Comm. Mass Spectrometry, 2001, 15, 957. [all data]
Bojesen and Breindahl, 1994
Bojesen, G.; Breindahl, T.,
On the Proton Affinity od Some Alpha-Amino Acids and the Theory of the Kinetic Method.,
J. Chem. Soc. Perkin 2, 1994, 1029. [all data]
Cannington and Ham, 1983
Cannington, P.H.; Ham, N.S.,
He(I) and He(II) photoelectron spectra of glycine and related molecules,
J. Electron Spectrosc. Relat. Phenom., 1983, 32, 139. [all data]
Slifkin and Allison, 1967
Slifkin, M.A.; Allison, A.C.,
Measurement of ionization potentials from contact charge transfer spectra,
Nature, 1967, 215, 949. [all data]
O'Hair, Bowie, et al., 1992
O'Hair, R.J.; Bowie, J.H.; Gronert, S.,
Gas Phase Acidity of the alpha-Amino Acids,
Int. J. Mass Spectrom. Ion Proc., 1992, 117, 23, https://doi.org/10.1016/0168-1176(92)80083-D
. [all data]
Jones, Bernier, et al., 2007
Jones, C.M.; Bernier, M.; Carson, E.; Colyer, K.E.; Metz, R.; Pawlow, A.; Wischow, E.D.; Webb, I.; Andriole, E.J.; Poutsma, J.C.,
Gas-phase Acities of the 20 Protein Amino Acids,
Int. J. Mass Spectrom., 2007, 267, 1-3, 54-62, https://doi.org/10.1016/j.ijms.2007.02.018
. [all data]