Spiro[3.4]oct-5-ene
- Formula: C8H12
- Molecular weight: 108.1809
- IUPAC Standard InChIKey: GSTBLMRSOPHVLU-UHFFFAOYSA-N
- CAS Registry Number: 14783-50-7
- Chemical structure:
View 3d structure (requires JavaScript / HTML 5) - Permanent link for this species. Use this link for bookmarking this species for future reference.

Gas phase ion energetics data

Data compiled as indicated in comments:
LLK - Sharon G. Lias, Rhoda D. Levin, and Sherif A. Kafafi
Ionization energy determinations
IE (eV) | Method | Reference | Comment |
---|---|---|---|
8.65 | PE | Bischof, Gleiter, et al., 1974 | LLK |
8.89 | PE | Bruckmann and Klessinger, 1974 | Vertical value; LLK |

References

Bischof, Gleiter, et al., 1974
Bischof, P.; Gleiter, R.; de Meijere, A.; Meyer, L.-U.,
The conjugative interaction between π-orbitals and cyclobutane-orbitals in spiro[3.4]octa-5,7-diene and spiro[3.4]octene-5,
Helv. Chim. Acta, 1974, 57, 1519. [all data]
Bruckmann and Klessinger, 1974
Bruckmann, P.; Klessinger, M.,
Photoelektronenspektren organischer verbindungen. V. Wechselwirkung kleiner ringe mit π-systemen,
Chem. Ber., 1974, 107, 1108. [all data]