Chromium,pentacarbonyl(pyridine)-
- Formula: C10H5CrNO5
- Molecular weight: 271.1465
- CAS Registry Number: 14740-77-3

Condensed phase thermochemistry data

Data compiled by: José A. Martinho Simões
Quantity | Value | Units | Method | Reference | Comment |
---|---|---|---|---|---|
ΔfH°solid | -732.5 ± 6.6 | kJ/mol | Review | Martinho Simões | The enthalpy of formation relies on -908.4 ± 2.6 kJ/mol for the enthalpy of formation of Cr(CO)6(g) |

Phase change data

Data compiled as indicated in comments:
MS - José A. Martinho Simões
AC - William E. Acree, Jr., James S. Chickos
Quantity | Value | Units | Method | Reference | Comment |
---|---|---|---|---|---|
ΔsubH° | 103.2 ± 1.8 | kJ/mol | DSC | Daamen, Ernsting, et al., 1979 | MS |
Enthalpy of sublimation
ΔsubH (kJ/mol) | Temperature (K) | Method | Reference | Comment |
---|---|---|---|---|
103.2 ± 1.8 | 306. | ME | Daamen, Ernsting, et al., 1979, 2 | Based on data from 294. to 317. K.; AC |

Gas phase ion energetics data

Data compiled by: Sharon G. Lias, Rhoda D. Levin, and Sherif A. Kafafi
Ionization energy determinations
IE (eV) | Method | Reference | Comment |
---|---|---|---|
7.30 | PE | Weiner, Gin, et al., 1977 | Vertical value |

Gas phase thermochemistry data

Data compiled by: José A. Martinho Simões
Quantity | Value | Units | Method | Reference | Comment |
---|---|---|---|---|---|
ΔfH°gas | -629.3 ± 6.8 | kJ/mol | Review | Martinho Simões | The enthalpy of formation relies on -908.4 ± 2.6 kJ/mol for the enthalpy of formation of Cr(CO)6(g) |

Reaction thermochemistry data

Data compiled by: José A. Martinho Simões
Individual Reactions
C10H5CrNO5 (solution) + (solution) =
(solution) +
(solution)
By formula: C10H5CrNO5 (solution) + CO (solution) = C6CrO6 (solution) + C4H4N2 (solution)
Quantity | Value | Units | Method | Reference | Comment |
---|---|---|---|---|---|
ΔrH° | -14.8 | kcal/mol | KinS | Wovkulich and Atwood, 1980 | solvent: Hexane; The data rely on the enthalpy and entropy of activation for the forward reaction, 25.4 ± 1.1 kcal/mol and 13.0±14.6 J/(mol K) Dennenberg and Darensbourg, 1972, and also on the enthalpy and entropy of activation for the Cr-CO dissociation in Cr(CO)6, 40.20 ± 0.60 kcal/mol and 94.6±6.3 J/(mol K) Graham and Angelici, 1967. The latter data were obtained in decalin |
C12H16CrO5 (solution) + (solution) =
(solution) + C10H5CrNO5 (solution)
By formula: C12H16CrO5 (solution) + C4H4N2 (solution) = C7H16 (solution) + C10H5CrNO5 (solution)
Quantity | Value | Units | Method | Reference | Comment |
---|---|---|---|---|---|
ΔrH° | -20.1 ± 0.41 | kcal/mol | PAC | Yang, Vaida, et al., 1988 | solvent: Heptane |
C10H5CrNO5 (cr) + (g) =
(g) +
(g)
By formula: C10H5CrNO5 (cr) + CO (g) = C6CrO6 (g) + C4H4N2 (g)
Quantity | Value | Units | Method | Reference | Comment |
---|---|---|---|---|---|
ΔrH° | 18. ± 1. | kcal/mol | DSC | Daamen, van der Poel, et al., 1979 |

References

Martinho Simões
Martinho Simões, J.A.,
Private communication (see http://webbook.nist.gov/chemistry/om/). [all data]
Daamen, Ernsting, et al., 1979
Daamen, H.; Ernsting, J.M.; Oskam, A.,
Thermochim. Acta, 1979, 33, 217. [all data]
Daamen, Ernsting, et al., 1979, 2
Daamen, H.; Ernsting, J.M.; Oskam, A.,
Vapour pressure measurements on M(CO)5L (M = Cr, Mo, W; L = piperidine, pyridine, pyrazine, pyrazole, thiazole),
Thermochimica Acta, 1979, 33, 217-223, https://doi.org/10.1016/0040-6031(79)87044-6
. [all data]
Weiner, Gin, et al., 1977
Weiner, M.A.; Gin, A.; Lattman, M.,
Ultraviolet photoelectron spectra of 4-substituted pyridine- pentacarbonylchromium complexes,
Inorg. Chim. Acta, 1977, 24, 235. [all data]