Rhenium, pentacarbonyl(pentacarbonylmanganese)-, (Mn-Re)
- Formula: C10MnO10Re
- Molecular weight: 521.246
- IUPAC Standard InChIKey: JHLLDJQETNNXIR-UHFFFAOYSA-N
- CAS Registry Number: 14693-30-2
- Chemical structure:
View 3d structure (requires JavaScript / HTML 5) - Other names: Rhenium, pentacarbonyl(pentacarbonylmanganio)-; Decacarbonylmanganeserhenium; Manganese rhenium carbonyl (MnRe(CO)10); Manganese, decacarbonylrhenium-; MnRe(CO)10

Phase change data

Data compiled by: William E. Acree, Jr., James S. Chickos
Quantity | Value | Units | Method | Reference | Comment |
---|---|---|---|---|---|
ΔsubH° | 86. ± 4. | kJ/mol | N/A | Addison, Connor, et al., 1998 |
Enthalpy of vaporization
ΔvapH (kJ/mol) | Temperature (K) | Reference | Comment |
---|---|---|---|
56.5 | 451. | Baev, Dem'yanchuk, et al., 1971 | Based on data from 440. to 463. K. |
56.5 | 451. | Baev, Dem'yanchuk, et al., 1971 | Based on data from 440. to 463. K. |
Enthalpy of sublimation
ΔsubH (kJ/mol) | Temperature (K) | Method | Reference | Comment |
---|---|---|---|---|
109. ± 4. | 363. | C | Addison, Connor, et al., 1998 | |
68.6 | 401. | MM | Baev, Dem'yanchuk, et al., 1971 | Based on data from 363. to 440. K. |

Gas phase ion energetics data

Data compiled as indicated in comments:
LLK - Sharon G. Lias, Rhoda D. Levin, and Sherif A. Kafafi
RDSH - Henry M. Rosenstock, Keith Draxl, Bruce W. Steiner, and John T. Herron
Ionization energy determinations
IE (eV) | Method | Reference | Comment |
---|---|---|---|
8.22 ± 0.01 | EI | Michels and Svec, 1981 | LLK |
8.14 ± 0.01 | EI | Junk and Svec, 1970 | RDSH |
Appearance energy determinations
Ion | AE (eV) | Other Products | Method | Reference | Comment |
---|---|---|---|---|---|
CMnO+ | 19.05 | ? | EI | Svec and Junk, 1967 | RDSH |
CMnORe+ | 23.00 | 9CO | EI | Svec and Junk, 1967 | RDSH |
C2MnO2Re+ | 19.75 | 8CO | EI | Svec and Junk, 1967 | RDSH |
C3MnO3Re+ | 16.94 | 7CO | EI | Svec and Junk, 1967 | RDSH |
C4MnO4Re+ | 14.65 | 6CO | EI | Svec and Junk, 1967 | RDSH |
C5MnO5+ | 10.50 | ? | EI | Junk and Svec, 1970 | RDSH |
C5MnO5Re+ | 12.12 | 5CO | EI | Svec and Junk, 1967 | RDSH |
C5O5Re+ | 10.80 | ? | EI | Svec and Junk, 1967 | RDSH |
C6O6Re+ | 9.36 | ? | EI | Svec and Junk, 1967 | RDSH |
Mn+ | 25.67 | ? | EI | Svec and Junk, 1967 | RDSH |
MnRe+ | 25.98 | 10CO | EI | Svec and Junk, 1967 | RDSH |
Re+ | 30.93 | ? | EI | Svec and Junk, 1967 | RDSH |

References

Addison, Connor, et al., 1998
Addison, Susan J.; Connor, Joseph A.; Kinkaid, John A.,
High temperature microcalorimetric studies of the thermal decomposition and halogenation of nonacarbonylcobaltmanganese, nonacarbonylcobaltrhenium and decacarbonylmanganeserhenium,
Journal of Organometallic Chemistry, 1998, 554, 2, 123-127, https://doi.org/10.1016/S0022-328X(97)00663-3
. [all data]
Baev, Dem'yanchuk, et al., 1971
Baev, A.K.; Dem'yanchuk, V.V.; Mirzoev, G.; Noikov, G.I.; Kolobova, N.E.,
Russ. J. Phys. Chem., 1971, 45, 6, 777. [all data]
Michels and Svec, 1981
Michels, G.D.; Svec, H.J.,
Characterization of MnTc(CO)10 and TcRe(CO)10,
Inorg. Chem., 1981, 20, 3445. [all data]
Junk and Svec, 1970
Junk, G.A.; Svec, H.J.,
The mass spectra, ionization potentials, and bond energies of the group VIIA decacarbonyls,
J. Chem. Soc. A, 1970, 2102. [all data]
Svec and Junk, 1967
Svec, H.J.; Junk, G.A.,
Energetics of the ionization and dissociation of Mn2(CO)10, Re2(CO)10, and ReMn(CO)10,
J. Am. Chem. Soc., 1967, 89, 2836. [all data]